program: Gaussian 09
title: 000131774
version: EM64L-G09RevD.01
frameworkgroup: C1[X(C14H13N3O3S)]
method: RPBEPBE
basis: SDD
operation: Freq
keyword: #p
keyword: freq=noraman
keyword: PBEPBE/SDD
title: #p freq=noraman PBEPBE/SDD
converged: YES YES NO NO
title: Mulliken charges:
elementType: S O O O N N N C C C C C C C C C C C C C C H H H H H H H H H H H H H
charge: 0.918539 -0.258105 -0.541270 -0.549733 -0.460015 -0.034511 0.047831 0.229951 -0.071286 0.118811 0.215822 -0.391131 -0.361332 -0.304959 0.295105 -0.211469 -0.742742 -0.334137 -0.141850 -0.372622 -0.523050 0.310669 0.248174 0.295324 0.322720 0.268274 0.295096 0.264428 0.244079 0.231883 0.245903 0.300966 0.208668 0.235967
chargesum: 0.00000
title: Mulliken charges with hydrogens summed into heavy atoms:
elementType: S O O O N N N C C C C C C C C C C C C C C
charge: 0.918539 -0.258105 -0.541270 -0.549733 -0.137294 -0.034511 0.047831 0.229951 -0.071286 0.118811 0.215822 -0.080462 -0.113158 -0.009635 0.295105 -0.211469 0.085056 -0.090058 0.090034 -0.126718 0.222550
polarizability: 3.74834129e+02 -4.30309289e+00 1.94292061e+02 -6.38143515e+00 -1.22639579e+01 1.22748270e+02
1716.lowfreq: -5.8728 -0.0015 -0.0009 -0.0008 2.3287 3.6439 25.9154 35.6537 47.7184
frequency: 25.8070 35.6086 47.7169 50.9514 84.1248 104.1439 123.8709 152.8309 157.4768 169.8937 180.2944 221.7528 225.5305 235.7603 253.0986 262.9332 289.0898 308.5844 328.7610 355.8948 381.0509 415.6445 439.9182 471.8261 483.5033 509.1792 558.4319 574.4266 587.0065 592.3449 606.4020 617.7075 627.8650 657.5820 706.6047 749.1413 766.9320 786.2851 787.3397 802.6449 810.5253 829.6026 885.4900 887.0867 905.5732 917.5228 919.2335 960.2353 966.6635 967.0802 982.6782 1008.1678 1025.0097 1043.4098 1071.8143 1112.0446 1119.7016 1131.1675 1155.6626 1189.7898 1219.9241 1226.5415 1255.3771 1280.6651 1290.5770 1301.4687 1318.0710 1361.1227 1367.4745 1388.4316 1394.0991 1407.9174 1421.1293 1437.9824 1449.0816 1452.5061 1461.8365 1476.9378 1523.9798 1548.3227 1570.8798 1603.0742 1616.9614 2977.6108 3029.2958 3089.1983 3131.9483 3136.8981 3138.2341 3147.7691 3162.5968 3168.6410 3173.6511 3178.9213 3183.1162 3581.9248
redmass: 5.4609 6.1156 5.3172 6.3099 3.6147 4.5506 4.1258 3.0149 1.2962 8.5601 2.1326 5.8611 4.7445 1.6528 4.6805 5.0417 3.7149 5.5948 7.7153 6.3605 5.8158 6.7870 4.3426 3.7945 6.2346 5.5832 6.3655 7.4309 3.9466 3.7796 1.3379 5.3795 6.0156 6.9939 5.5587 3.9851 7.5170 1.9657 5.9008 3.3817 6.4377 1.4206 6.6456 3.0603 1.5492 1.4728 5.0319 1.5010 1.3738 1.5152 3.4166 1.9196 2.5780 3.8749 1.8134 1.6088 1.2737 1.6115 1.3164 2.4511 2.6639 1.8859 1.5754 3.4644 3.1892 1.1415 2.2631 3.9832 8.3059 3.7037 2.0803 1.0529 1.0547 1.6609 1.2707 1.8211 1.7555 1.1126 4.8999 6.9249 8.7354 7.0766 7.3664 1.0324 1.0247 1.1010 1.1049 1.0886 1.0881 1.0924 1.0919 1.0960 1.0993 1.1070 1.1078 1.0814
irintensity: 1.4294 1.9426 3.5396 1.7838 3.0682 8.2870 9.1275 0.4760 0.5450 2.1765 2.3486 3.3260 0.9520 1.0072 2.1871 6.0130 8.2500 6.5946 7.5580 28.6769 3.7075 51.5607 3.6523 4.3040 5.5842 12.0031 38.1421 4.4363 6.0640 19.0818 67.2121 58.4065 1.8378 17.8020 2.5409 5.7653 7.1150 24.5091 104.9084 18.0290 15.7814 24.7470 7.1260 29.2277 19.8089 0.2469 1.2309 23.4500 3.6602 90.9014 9.3539 52.8284 1.8635 13.3017 33.1715 7.0707 0.8769 12.3478 3.3936 0.5425 76.8372 29.7472 12.7325 101.3878 5.9612 4.7582 31.3030 81.0522 9.7132 84.0560 57.6947 9.2619 15.1337 4.4634 63.2455 8.2754 87.5523 11.7924 47.8525 13.0170 47.4941 39.5777 4.5141 50.8149 1.3704 28.2876 12.6228 7.6911 10.1675 12.4107 6.5631 12.3138 26.7066 0.9324 1.3118 30.7863
temp: 298.150 k
press: 1.00000 atm
elementType: 16 8 8 8 7 7 7 6 6 6 6 6 6 6 6 6 6 6 6 6 6 1 1 1 1 1 1 1 1 1 1 1 1 1
symmnumber: 1
zpe: 652554.5 jmol-1
zpe.correction: 0.248545 hartree
zpe.thermalcorrener: 0.267946 hartree
zpe.thermalcorrenthalpy: 0.268890 hartree
zpe.thermalcorrgfe: 0.199561 hartree
zpe.sumelectzpe: -1327.595341 hartree
zpe.sumelectthermal: -1327.575940 hartree
zpe.sumelectthermalent: -1327.574996 hartree
zpe.sumelectthermalfe: -1327.644326 hartree
dipole: 4.7443 -3.7853 8.7112
dipole: 10.6171
quadrupole: -139.0275 -126.8797 -132.9080
quadrupole: -13.8150 -12.4028 -0.3102
quadrupole: -6.0891 6.0587 0.0304 -13.8150 -12.4028 -0.3102
hfenergy: -1327.8438862 hartree
pointgroup: C01 [X(C14H13N3O3S1)]
dipole: -1.8608367 -1.6303924 -3.3655776 debye
polarizability: 375.0492768|-0.7166077|195.3510685|-2.8069041|8.3579253|121.4741143 unknown
InChI: InChI=1S/C14H13N3O3S/c1-20-12-8-9(21(2,18)19)5-6-10(12)13-16-11-4-3-7-15-14(11)17-13/h3-8,16H,1-2H3
charge 0 multiplicity 1
34 atoms
S  5.007803 -0.445786 0.284639
O  0.815765 2.448537 -0.465059
O  5.567159 0.966011 0.890782
O  5.285326 -1.890184 1.003915
N  -1.872716 -1.075538 -0.710978
N  -1.944927 0.847536 0.527901
N  -4.396565 0.932001 0.803551
C  0.335414 -0.032481 -0.136512
C  3.125251 -0.289085 0.073889
C  -1.138844 -0.023689 -0.113157
C  1.173815 1.130675 -0.233795
C  2.585142 0.982173 -0.093343
C  0.962507 -1.305584 0.046386
C  2.353741 -1.46275 0.148375
C  -3.222657 -0.855878 -0.439673
C  -3.253033 0.360904 0.336263
C  5.673283 -0.581838 -1.507636
C  -4.415746 -1.530263 -0.7614
C  -5.599918 -0.936556 -0.271419
C  -5.544185 0.269034 0.489375
C  -0.474084 2.856706 -1.054044
H  3.212554 1.878968 -0.111974
H  0.324888 -2.186265 0.183094
H  2.823084 -2.431544 0.343001
H  -1.476923 -1.816665 -1.287757
H  5.396707 0.347062 -2.024735
H  6.761494 -0.685554 -1.394031
H  5.21584 -1.475041 -1.954483
H  -4.438049 -2.454499 -1.347651
H  -6.57313 -1.395298 -0.470589
H  -6.469725 0.721239 0.862326
H  -1.27439 2.790664 -0.300623
H  -0.724389 2.222888 -1.926131
H  -0.302992 3.893798 -1.378508
