program: Gaussian 09
title: 000131773
version: EM64L-G09RevD.01
frameworkgroup: C1[X(C7H10N2O3S)]
method: RPBEPBE
basis: SDD
operation: Freq
keyword: #p
keyword: freq=noraman
keyword: PBEPBE/SDD
title: #p freq=noraman PBEPBE/SDD
converged: YES YES NO NO
title: Mulliken charges:
elementType: S O O O N N C C C C C C C H H H H H H H H H H
charge: 0.699303 -0.274585 -0.628802 -0.255623 -0.154628 -0.039639 0.241568 -0.131751 -0.631419 -0.359755 0.160749 -0.778791 -0.497506 0.258515 0.247748 0.297828 0.284601 0.286079 0.291838 0.261099 0.243299 0.244116 0.235756
chargesum: 0.00000
title: Mulliken charges with hydrogens summed into heavy atoms:
elementType: S O O O N N C C C C C C C
charge: 0.699303 -0.274585 -0.628802 -0.255623 -0.154628 -0.039639 0.241568 -0.131751 0.172672 -0.075154 0.160749 0.060226 0.225665
polarizability: 1.83120988e+02 3.41611304e+00 1.25244053e+02 -3.97415648e+00 -1.65612521e-01 6.79328482e+01
1716.lowfreq: -1.5444 -0.0011 0.0002 0.0021 3.7968 7.9835 31.1536 49.8638 62.3743
frequency: 31.1048 49.8602 62.3734 92.4255 108.6981 130.0937 152.9172 157.2255 182.5650 194.3289 239.0935 247.4937 270.0014 294.7067 297.7187 342.2983 368.7532 452.2024 530.7073 551.9070 612.1460 669.6382 670.5211 726.4176 746.2892 779.9610 867.2378 889.2373 927.1580 961.3607 973.1665 1074.6751 1104.4373 1113.4433 1132.8694 1146.0593 1155.7380 1211.6003 1271.1463 1292.6161 1316.6011 1334.2423 1381.5993 1418.8908 1421.4836 1429.1430 1452.2889 1463.4748 1468.5793 1473.5270 1485.1447 1502.2236 1630.6990 2999.4845 3005.0857 3020.8783 3106.5581 3107.4229 3124.3700 3151.4540 3169.0549 3174.1139 3251.3948
redmass: 4.4490 4.8771 3.0888 1.2350 4.5999 2.9839 1.1690 1.1147 4.2188 4.3072 4.7969 5.3756 5.4669 5.1869 3.8126 5.4423 6.8809 8.8962 5.2500 7.1622 5.2859 8.2830 5.7854 6.2198 6.1976 14.1920 1.4582 7.1035 5.9280 1.2436 1.2779 4.8073 2.1453 1.2603 1.3120 1.5261 1.9274 4.1112 3.8232 1.3351 3.6239 5.0605 3.4025 1.0594 1.2594 1.0560 1.0498 1.0593 1.4454 1.4849 1.1629 1.7411 10.1452 1.0353 1.0297 1.0246 1.1046 1.1044 1.1013 1.1046 1.1070 1.1075 1.0993
irintensity: 7.0895 1.8376 1.9473 1.2634 0.9026 4.0611 0.1707 0.8676 8.2799 2.3926 1.6087 1.2336 11.9383 7.6784 26.4421 8.3809 15.4678 7.5816 7.3816 13.8194 0.2640 2.5614 1.6204 17.0863 9.5412 48.3790 20.0027 11.3370 12.9004 21.2249 18.0264 249.2585 0.1953 0.0533 0.9169 111.2517 58.0919 108.1441 21.2086 24.5266 70.5468 84.2133 7.1339 22.8665 16.9157 14.1866 14.6718 25.1455 48.6874 47.6245 26.1919 29.4554 283.2151 36.7022 39.1382 5.3421 24.3942 6.9950 8.7532 14.6114 5.1895 0.9238 1.1468
temp: 298.150 k
press: 1.00000 atm
elementType: 16 8 8 8 7 7 6 6 6 6 6 6 6 1 1 1 1 1 1 1 1 1 1
symmnumber: 1
zpe: 442438.3 jmol-1
zpe.correction: 0.168516 hartree
zpe.thermalcorrener: 0.183304 hartree
zpe.thermalcorrenthalpy: 0.184248 hartree
zpe.thermalcorrgfe: 0.125545 hartree
zpe.sumelectzpe: -1004.891067 hartree
zpe.sumelectthermal: -1004.876278 hartree
zpe.sumelectthermalent: -1004.875334 hartree
zpe.sumelectthermalfe: -1004.934037 hartree
dipole: 2.1084 -2.3624 0.3199
dipole: 3.1825
quadrupole: -72.1558 -90.7430 -82.7702
quadrupole: 5.8171 -0.7335 -3.0366
quadrupole: 9.7339 -8.8533 -0.8805 5.8171 -0.7335 -3.0366
hfenergy: -1005.0595824 hartree
pointgroup: C01 [X(C7H10N2O3S1)]
dipole: 0.810983 -0.9411547 0.1558729 debye
dipolederiv: 0.8006528 -0.1428104 0.0968724 -0.3204972 0.7666218 -0.2027108 -0.0301913 -0.0266455 0.4424305 -1.5961149 0.2510856 -0.0741964 0.6778845 -0.615105 0.0316274 -0.0761978 0.0040034 -0.3046611 -0.5690036 -0.0333382 -0.0843248 0.1859069 -0.6242413 0.2359089 0.1090892 -0.1824494 -0.3967599 -0.800887 -0.1840848 -0.0407692 -0.1586186 -0.930718 -0.0366534 -0.0541065 -0.0580078 -0.3171238 0.1462629 0.0634145 0.0014044 0.0618809 -0.6144312 -0.042198 -0.0173371 -0.0167058 -0.0813173 -0.8701041 0.0763082 -0.0310376 0.32409 -0.5152673 -0.0030392 -0.0358699 -0.0374118 -0.2309933 -1.0411836 -0.3117965 -0.0515016 -0.4507047 -0.0431358 -0.0492176 -0.130294 -0.0313589 0.0040712 0.080892 0.0980248 0.005488 -0.3674107 0.3335948 -0.0022841 -0.061548 0.0682307 -0.0979103 -0.0002279 -0.0210921 -0.0146862 0.0758873 0.3182916 -0.019241 -0.020286 -0.0038505 0.1842408 0.375967 0.0227457 0.0730235 0.1851204 0.139927 0.0408999 0.056188 0.0181727 -0.0963413 2.2845972 0.072548 0.1331387 -0.2124533 1.2980848 0.0257033 0.1986989 0.0667957 0.2814129 -0.0484563 0.0398177 -0.0268485 -0.0130588 -0.1795872 0.020738 -0.0128741 0.1121515 -0.0727676 0.813106 -0.0491899 0.036971 0.0328543 0.2158166 -0.0012691 0.04735 -0.0056513 0.2813152 0.086639 -0.05953 -0.0811217 -0.0038544 0.0462326 0.0012665 -0.0706976 -0.0346691 -0.0145247 0.0794264 -0.0618814 0.0794594 -0.0107351 0.0172492 0.015056 0.0752825 0.0603174 -0.0318871 0.1446594 0.1477716 -0.0035915 -0.0065878 0.1227671 -0.0039145 0.0059109 0.0030947 0.124841 0.0472266 0.044102 -0.0032363 0.0668571 0.0687639 0.0000284 0.0000765 -0.0020732 0.1745814 0.1081801 -0.0479022 -0.0333579 -0.0290422 0.0373888 -0.0309986 -0.0218146 -0.0020679 -0.0283429 0.1356978 0.0399153 0.0269891 0.0309887 -0.0085136 -0.001138 0.0354175 0.0253405 0.0832975 -0.098916 -0.0305242 -0.0104079 -0.0146476 0.1089771 0.0228753 0.0173174 0.0333376 0.0835463 -0.0325667 0.018206 0.0039 -0.0793498 0.0663 -0.0974159 -0.0572076 -0.0669616 -0.0748528 -0.0359319 0.0041417 0.0031549 -0.1057582 0.0382383 0.099698 0.0447071 0.0849187 -0.0341295 -0.0099154 0.0640685 -0.0053217 0.1312482 -0.0472541 -0.0037216 -0.0016134 -0.0085101 0.1218749 unknown
polarizability: 183.342185|2.4657655|125.1411279|-1.169445|-0.6529667|67.8145768 unknown
InChI: InChI=1S/C7H10N2O3S/c1-9-5(6(10)12-2)4-8-7(9)13(3)11/h4H,1-3H3
charge 0 multiplicity 1
23 atoms
S  -3.211176 0.098569 -0.680854
O  3.112939 -0.772325 -0.019983
O  -3.465224 1.624146 -0.031191
O  2.501125 1.484022 0.067736
N  -0.33805 0.534774 -0.25662
N  -0.99492 -1.642873 -0.45833
C  0.827637 -0.267083 -0.203111
C  -1.388464 -0.349773 -0.400658
C  -0.408869 2.015648 -0.179059
C  0.387166 -1.598836 -0.328339
C  2.180196 0.271348 -0.040376
C  -3.871912 -1.117292 0.661933
C  4.525088 -0.352726 0.14149
H  0.1255 2.361468 0.718076
H  0.08344 2.457095 -1.060248
H  -1.47129 2.305928 -0.131433
H  0.998251 -2.496924 -0.328283
H  -3.575632 -0.684722 1.627903
H  -3.410171 -2.097603 0.477428
H  -4.964355 -1.13009 0.538661
H  4.661422 0.169615 1.103359
H  4.821782 0.319823 -0.680744
H  5.097618 -1.290088 0.114543
