program: Gaussian 09
title: 000131769
version: EM64L-G09RevD.01
frameworkgroup: C1[X(C9H12N6)]
method: RPBEPBE
basis: SDD
operation: Freq
keyword: #pfreq=noraman
keyword: PBEPBE/SDD
title: #p freq=noraman PBEPBE/SDD
converged: NO NO NO NO
title: Mulliken charges:
elementType: N N N N N N C C C C C C C C C H H H H H H H H H H H H
charge: -0.356278 -0.434756 -0.070474 -0.165673 -0.069621 -0.606772 0.387712 0.133057 -0.434257 0.188852 -0.318161 -0.327636 -0.351487 -0.717037 0.009488 0.278936 0.219944 0.219916 0.317929 0.201032 0.232562 0.330173 0.224549 0.224001 0.228011 0.329220 0.326768
chargesum: 0.00000
title: Mulliken charges with hydrogens summed into heavy atoms:
elementType: N N N N N N C C C C C C C C C
charge: -0.038349 -0.104583 -0.070474 -0.165673 -0.069621 0.049216 0.387712 0.133057 -0.155320 0.188852 0.121699 -0.126604 -0.118925 -0.040475 0.009488
polarizability: 2.21904655e+02 -4.82385682e+00 1.64924137e+02 8.69285170e-02 1.06719188e-01 6.70808091e+01
1716.lowfreq: -0.0005 -0.0002 0.0007 3.4652 5.1595 7.4417 37.3224 55.1652 70.8010
frequency: 36.5504 55.0921 70.8010 87.7451 107.5606 154.4227 204.7882 231.3909 261.7210 284.3423 310.7227 332.5531 345.3271 356.8050 391.1811 440.6671 455.4968 491.6819 496.6284 589.3583 611.8756 630.9026 671.9256 680.9721 727.5080 739.7964 744.2179 796.9501 814.0160 868.1338 894.0670 932.0967 945.2712 947.8790 954.7295 989.9810 1006.6519 1069.5991 1096.2352 1115.8595 1129.9131 1146.7321 1174.5230 1255.4056 1267.4728 1269.6922 1286.7171 1331.8147 1349.0571 1362.7253 1369.2380 1394.3050 1425.5234 1440.5080 1475.6129 1482.7631 1501.7246 1506.8178 1518.8233 1552.7786 1569.1746 1609.2809 1627.8721 2939.3415 2977.2416 2983.4013 3077.6684 3093.3876 3123.0682 3150.1900 3177.1592 3549.9470 3588.1318 3623.1330 3738.6080
redmass: 4.8265 2.6173 4.2674 4.5184 2.3391 4.1840 3.3604 6.1079 1.2497 3.7983 4.8242 5.0589 1.1781 4.2284 1.1668 4.1767 2.4952 1.2318 3.9267 3.5254 5.6267 1.3594 7.2892 6.1983 3.9203 4.3275 6.8460 1.5391 1.1120 3.3064 1.5457 3.2509 1.3788 6.3678 4.7101 2.0631 3.5002 2.3551 1.7598 2.7544 5.5633 1.4968 2.5887 1.7773 1.1066 2.2344 1.8326 3.2008 2.3136 2.1688 2.1090 1.2417 1.9306 2.3131 1.0404 1.0795 1.5644 2.0566 3.3995 2.0847 5.0142 6.0350 2.1090 1.0578 1.1042 1.0361 1.1009 1.0989 1.0873 1.0972 1.0922 1.0766 1.0445 1.0824 1.1055
irintensity: 0.7877 0.0014 0.6111 0.0001 6.4152 0.0166 0.0279 3.9257 1.4072 0.6787 5.1732 2.1651 330.4355 2.2295 11.7681 18.6086 32.9004 78.3961 6.2312 6.9805 3.8006 97.5175 8.9338 1.1777 27.1490 0.4872 3.0963 43.5177 11.4126 16.0313 23.6192 4.8762 0.2940 2.4639 24.7929 5.2217 0.3698 0.1440 2.2679 1.2669 60.8036 1.8934 20.8717 0.1914 0.1432 23.7521 19.8662 24.4310 0.1372 8.0931 39.9210 31.3439 9.6862 44.4438 13.0222 52.8598 188.9952 50.7036 123.5067 81.4688 156.4286 416.7333 502.1109 43.6568 34.6862 32.9968 42.8738 29.6699 15.4691 31.2879 2.3727 57.4043 104.0057 52.1994 47.8911
temp: 298.150 k
press: 1.00000 atm
elementType: 7 7 7 7 7 7 6 6 6 6 6 6 6 6 6 1 1 1 1 1 1 1 1 1 1 1 1
symmnumber: 1
zpe: 562324.1 jmol-1
zpe.correction: 0.214178 hartree
zpe.thermalcorrener: 0.228210 hartree
zpe.thermalcorrenthalpy: 0.229154 hartree
zpe.thermalcorrgfe: 0.172498 hartree
zpe.sumelectzpe: -677.574167 hartree
zpe.sumelectthermal: -677.560135 hartree
zpe.sumelectthermalent: -677.559191 hartree
zpe.sumelectthermalfe: -677.615848 hartree
dipole: -0.3721 -1.8740 -0.0028
dipole: 1.9106
quadrupole: -78.2472 -73.1534 -93.0926
quadrupole: 4.7609 0.0277 0.0197
quadrupole: 3.2505 8.3444 -11.5949 4.7609 0.0277 0.0197
hfenergy: -677.7883453 hartree
pointgroup: C01 [X(C9H12N6)]
dipole: 0.1202099 -0.7420021 0.0011023 debye
polarizability: 222.1745689|2.7962452|164.6542508|0.0257997|-0.1159181|67.0807809 unknown
InChI: InChI=1S/C9H12N6/c1-2-11-7-5-6(3-4-12-7)8-13-9(10)15-14-8/h3-5,11,14H,2,10H2,1H3
charge 0 multiplicity 1
27 atoms
N  3.2495 -0.43792 0.002485
N  -2.790683 1.016992 -0.001093
N  2.412935 1.736795 -0.000004
N  -1.990259 -1.067562 0.001359
N  -3.941475 0.217246 -0.000493
N  -4.137761 -2.192175 0.002164
C  -0.270915 0.779834 -0.000217
C  2.141602 0.384511 0.001569
C  0.809042 -0.130195 0.002093
C  -1.638424 0.250495 0.000022
C  3.205657 -1.902753 0.003939
C  0.003367 2.179139 -0.002475
C  1.352816 2.589503 -0.001954
C  4.630197 -2.484579 -0.010377
C  -3.384721 -1.041277 0.001036
H  0.598151 -1.202137 0.004592
H  2.661817 -2.269114 0.900911
H  2.644204 -2.268798 -0.88204
H  4.150295 0.044622 0.004816
H  -0.789225 2.934585 -0.004459
H  1.607531 3.655862 -0.003163
H  -2.899093 2.027995 -0.002073
H  5.181625 -2.162918 -0.913268
H  5.200057 -2.163088 0.881158
H  4.591412 -3.587539 -0.009751
H  -3.663837 -3.089052 0.003035
H  -5.150716 -2.14047 0.001689
