program: Gaussian 09
title: 000131768
version: EM64L-G09RevD.01
frameworkgroup: C1[X(C16H17N3O3S)]
method: RPBEPBE
basis: SDD
operation: Freq
keyword: #p
keyword: freq=noraman
keyword: PBEPBE/SDD
title: #p freq=noraman PBEPBE/SDD
converged: YES YES NO NO
title: Mulliken charges:
elementType: S O O O N N N C C C C C C C C C C C C C C C C H H H H H H H H H H H H H H H H H
charge: 0.689556 -0.236501 -0.262028 -0.646290 -0.459148 0.006003 0.038083 0.209986 0.101647 0.242318 0.289272 -0.371797 -0.267557 -0.218930 -0.502851 -0.654300 0.347946 -0.398626 -0.337526 -0.150156 -0.378926 -0.813120 -0.534867 0.315795 0.235251 0.276114 0.226120 0.274268 0.295011 0.251784 0.244305 0.238375 0.225467 0.237701 0.248121 0.270589 0.273940 0.223189 0.248238 0.223542
chargesum: 0.00000
title: Mulliken charges with hydrogens summed into heavy atoms:
elementType: S O O O N N N C C C C C C C C C C C C C C C C
charge: 0.689556 -0.236501 -0.262028 -0.646290 -0.143353 0.006003 0.038083 0.209986 0.101647 0.242318 0.289272 -0.136547 0.234676 -0.218930 -0.228583 -0.107504 0.347946 -0.154321 -0.099151 0.075311 -0.141225 -0.020470 0.160102
polarizability: 3.73386477e+02 2.54398046e+01 2.30528892e+02 -2.74711469e+00 -2.70115879e+01 1.50197826e+02
1716.lowfreq: -0.0014 -0.0011 0.0006 3.5274 5.3246 6.6981 20.6751 23.7964 34.0923
frequency: 20.5426 23.7666 34.0817 42.3937 49.8957 55.4955 90.0570 94.5122 112.4952 147.2840 168.7623 183.2316 205.3778 221.9072 227.2305 235.9830 244.3120 247.2603 267.3616 272.8871 313.7685 321.5126 381.2119 394.7169 433.9378 453.1491 465.2145 486.8419 499.7779 543.7815 557.1713 572.2122 589.0330 592.5634 600.1628 617.7499 625.9642 633.3243 702.7055 713.3777 745.6592 778.8905 781.5197 786.9692 795.7385 799.9857 830.2220 857.0824 882.5986 903.9778 910.3320 919.4361 933.3821 947.2251 952.0505 958.2976 973.3039 982.3420 1012.3789 1026.5438 1047.4481 1068.2239 1109.4539 1112.4527 1139.9825 1148.6667 1157.3656 1183.9043 1189.9737 1207.8249 1227.7630 1250.5918 1262.6287 1277.2333 1281.7231 1292.7705 1303.6647 1314.4732 1367.2387 1372.5088 1388.6342 1391.8012 1400.3354 1418.1858 1419.1821 1437.3038 1440.4995 1450.3971 1457.7976 1467.4554 1473.1395 1480.8024 1535.4660 1553.8003 1573.3334 1616.9940 1623.5276 2935.9879 2963.8928 3010.2172 3015.0322 3049.0687 3053.8676 3127.5304 3129.2799 3130.4218 3141.4817 3145.0619 3150.3807 3158.7893 3168.9845 3175.2469 3183.8413 3582.6343
redmass: 6.2303 5.5670 5.7898 5.0658 5.5159 4.5624 4.1865 4.1821 4.5672 5.2790 1.7741 1.6810 2.5386 1.9319 4.1662 2.8523 4.2399 3.9292 4.1811 4.3537 5.6325 2.5335 5.5860 4.6584 4.3147 4.3215 3.5753 5.5943 4.3619 6.7149 6.3458 5.0361 3.3297 2.1654 1.9019 6.6156 4.0102 5.0158 4.7801 5.0306 3.2293 10.5307 1.5590 5.8208 1.6596 3.7367 2.7901 1.7386 7.0813 2.6598 1.3753 4.6115 1.4003 1.5110 1.7810 1.3612 1.6023 1.7676 3.8107 2.4304 3.4222 2.2078 1.5859 1.2582 1.5517 1.6881 1.2590 1.8838 2.3139 1.2976 1.7716 2.4606 1.3756 2.4203 2.0330 3.5232 1.1488 2.1801 2.1716 3.6370 2.1890 2.5729 1.2897 1.2507 1.9108 1.3005 1.0584 2.4025 1.2052 1.0501 1.0705 2.5337 4.9098 6.8835 8.0477 7.3674 6.8873 1.0594 1.0327 1.0263 1.1001 1.0584 1.1042 1.0905 1.0985 1.0880 1.0918 1.1102 1.1059 1.1056 1.0991 1.0936 1.0911 1.0812
irintensity: 0.0882 14.2397 2.5423 7.6289 2.3491 2.0451 3.2533 1.0641 0.8675 1.9443 1.3021 1.7082 2.3855 1.3838 13.4933 11.0964 1.2312 4.6312 11.3323 4.0128 0.2349 1.1191 0.3820 1.7156 0.3378 3.3536 4.1460 10.6320 12.2529 13.3233 17.1647 4.5566 2.4064 39.3830 54.3089 3.8604 13.1276 4.9145 1.4182 3.0650 1.2174 27.3170 76.3598 0.9457 30.0354 7.8094 2.3451 44.9007 4.6982 2.7738 0.0642 4.3409 0.8380 12.4106 4.4215 1.6132 16.9423 26.8332 79.2924 8.5461 38.0461 18.1400 9.3538 0.1857 69.3887 126.5718 25.1242 149.4676 3.7227 2.3252 51.5594 173.0450 19.1260 54.7936 94.8808 5.0102 6.9234 27.2556 27.9635 65.1128 73.6502 28.5587 10.5158 22.0447 101.3278 27.4114 13.4851 51.2520 85.5524 13.8571 41.7868 109.1465 36.8797 29.2541 99.2804 80.9585 254.6931 21.3552 80.9694 9.1947 10.8232 14.2465 44.7438 25.3057 12.7299 14.5220 14.8412 3.2062 6.8520 5.1128 33.7970 11.8035 1.7887 23.9539
temp: 298.150 k
press: 1.00000 atm
elementType: 16 8 8 8 7 7 7 6 6 6 6 6 6 6 6 6 6 6 6 6 6 6 6 1 1 1 1 1 1 1 1 1 1 1 1 1 1 1 1 1
symmnumber: 1
zpe: 800225.3 jmol-1
zpe.correction: 0.304790 hartree
zpe.thermalcorrener: 0.326857 hartree
zpe.thermalcorrenthalpy: 0.327801 hartree
zpe.thermalcorrgfe: 0.250965 hartree
zpe.sumelectzpe: -1406.118428 hartree
zpe.sumelectthermal: -1406.096361 hartree
zpe.sumelectthermalent: -1406.095417 hartree
zpe.sumelectthermalfe: -1406.172253 hartree
dipole: -1.1969 -3.2883 0.9879
dipole: 3.6361
quadrupole: -126.0323 -106.8270 -149.0703
quadrupole: 13.7607 16.4262 -23.5336
quadrupole: 1.2776 20.4829 -21.7605 13.7607 16.4262 -23.5336
hfenergy: -1406.423218 hartree
pointgroup: C01 [X(C16H17N3O3S1)]
dipole: -0.7861263 -1.164235 0.2702782 debye
polarizability: 372.7004146|-14.8474731|233.7340076|-30.6048316|-10.6938943|147.6787724 unknown
InChI: InChI=1S/C16H17N3O3S/c1-21-11-5-6-12(14(10-11)22-8-9-23(2)20)15-18-13-4-3-7-17-16(13)19-15/h3-7,10,18H,8-9H2,1-2H3
charge 0 multiplicity 1
40 atoms
S  1.16863 3.71604 1.26197
O  -0.55937 1.42863 -0.191802
O  -5.135178 -0.009015 0.395063
O  -0.119131 4.052863 2.287456
N  0.992389 -2.322753 0.428247
N  1.294265 -0.624364 -1.081736
N  3.676592 -1.071972 -1.550462
C  -1.016252 -0.919538 -0.081478
C  0.409053 -1.230778 -0.263364
C  -1.512073 0.426694 -0.069707
C  2.325018 -2.410497 0.031081
C  -1.95562 -1.966551 0.085289
C  -0.999075 2.83142 -0.288893
C  2.498069 -1.334444 -0.91923
C  -2.88851 0.683388 0.089547
C  0.268656 3.632571 -0.492436
C  -3.796781 -0.390595 0.248377
C  -3.336048 -1.729873 0.251554
C  3.399141 -3.256219 0.362856
C  4.619568 -2.977701 -0.293835
C  4.708321 -1.900176 -1.222764
C  1.982891 5.435234 0.967808
C  -6.12886 -1.070527 0.583092
H  0.531418 -2.86929 1.154225
H  -1.604621 -3.004151 0.035434
H  -1.494514 3.157563 0.652939
H  -1.687456 2.954087 -1.149079
H  -3.286092 1.700299 0.119408
H  0.969833 3.151693 -1.191087
H  0.050257 4.678675 -0.761384
H  -4.022956 -2.572907 0.358517
H  3.308987 -4.079787 1.078858
H  5.507589 -3.586072 -0.096091
H  5.659247 -1.693987 -1.727228
H  2.637842 5.382624 0.083904
H  2.557523 5.663892 1.876736
H  1.157304 6.150611 0.835305
H  -6.166091 -1.744783 -0.294182
H  -7.089682 -0.546616 0.689863
H  -5.919283 -1.65789 1.497728
