program: Gaussian 09
title: 000131767
version: EM64L-G09RevD.01
frameworkgroup: C1[X(C7H6N2OS)]
method: RPBEPBE
basis: SDD
operation: Freq
keyword: #p
keyword: freq=noraman
keyword: PBEPBE/SDD
title: #p freq=noraman PBEPBE/SDD
converged: YES YES NO YES
title: Mulliken charges:
elementType: S O N N C C C C C C C H H H H H H
charge: 0.308087 -0.214211 0.005961 -0.018851 -0.478980 0.169181 -0.425552 0.240200 -0.625666 -0.473247 -0.157284 0.270667 0.270673 0.269931 0.269852 0.309599 0.279641
chargesum: 0.00000
title: Mulliken charges with hydrogens summed into heavy atoms:
elementType: S O N N C C C C C C C
charge: 0.308087 -0.214211 0.005961 -0.018851 0.062359 0.169181 0.114231 0.240200 -0.316067 -0.193606 -0.157284
polarizability: 1.50541537e+02 -2.98654588e+00 1.03081125e+02 4.16242146e-04 -2.96875749e-03 4.94350231e+01
1716.lowfreq: -4.8311 -4.4030 -0.0029 -0.0021 -0.0008 7.4008 38.5759 55.1321 74.1140
frequency: 38.4645 55.1203 74.1140 90.7646 171.6813 179.0088 249.5514 300.8493 365.6299 447.2245 459.0362 532.3299 535.6913 562.0759 668.5710 668.8922 756.6093 760.2474 773.3435 825.0625 840.0508 871.3514 943.5681 1006.0115 1006.5760 1066.8855 1149.7647 1153.1792 1208.8954 1265.5613 1267.0356 1296.9233 1352.4558 1425.0557 1442.9924 1448.2399 1478.2182 1596.9491 2201.5253 3003.1372 3015.2067 3047.5751 3073.0553 3229.1324 3249.6303
redmass: 6.2541 2.8804 10.1183 3.1625 6.0426 7.1848 7.6740 9.0318 3.6162 3.8298 9.2202 2.9329 6.4585 10.1803 9.4226 3.4274 6.6638 1.2378 1.5373 4.6641 1.3579 6.4911 4.5937 2.5813 2.1937 2.6006 1.5472 1.1659 1.4411 1.0987 1.6123 2.9494 1.8618 1.0999 1.1861 5.3059 7.7381 9.0811 12.4277 1.0623 1.0592 1.0982 1.1004 1.0969 1.0963
irintensity: 2.2440 5.2872 1.6732 9.4754 0.5742 10.8812 10.7826 1.2140 0.8127 2.1895 0.0322 1.9056 5.7431 16.2915 13.9490 0.0462 35.1033 2.0644 32.7999 46.5866 61.4152 15.8194 7.1924 5.4471 0.4023 1.7656 56.3402 0.1691 14.2248 0.0783 30.4282 29.0186 25.8766 20.4887 10.8425 42.4515 161.9577 123.2195 17.6729 12.2261 7.9164 0.6501 5.8002 1.1196 8.8097
temp: 298.150 k
press: 1.00000 atm
elementType: 16 8 7 7 6 6 6 6 6 6 6 1 1 1 1 1 1
symmnumber: 1
zpe: 305964.3 jmol-1
zpe.correction: 0.116536 hartree
zpe.thermalcorrener: 0.127143 hartree
zpe.thermalcorrenthalpy: 0.128087 hartree
zpe.thermalcorrgfe: 0.078275 hartree
zpe.sumelectzpe: -852.310452 hartree
zpe.sumelectthermal: -852.299845 hartree
zpe.sumelectthermalent: -852.298901 hartree
zpe.sumelectthermalfe: -852.348713 hartree
dipole: -5.7454 0.2701 0.0021
dipole: 5.7517
quadrupole: -87.4818 -74.4365 -70.0141
quadrupole: 11.6033 0.0139 -0.0034
quadrupole: -10.1710 2.8743 7.2967 11.6033 0.0139 -0.0034
hfenergy: -852.426988 hartree
pointgroup: C01[X(C7H6N2O1S1)]
dipole: -2.2622636 0.0537042 0.0022181 debye
dipolederiv: -0.4401738 0.1296347 0.0008299 -0.0255592 -0.1903581 -0.0019333 -0.0000886 -0.0019636 0.1718562 -0.7550565 -0.0550472 -0.0001238 -0.3294834 -0.8580561 -0.0030551 -0.0015749 -0.0031147 -0.2987152 -0.699594 0.2482949 0.0014434 0.0776628 -0.1868367 -0.0002881 0.00061 -0.0003344 -0.137719 -0.365991 0.0136964 0.0000197 0.1091608 -0.2440829 0.0000157 0.0008148 -0.0000213 -0.2387359 -0.1849975 0.1727903 0.0011161 0.4833641 -0.261746 -0.0024745 0.0029705 -0.0022957 0.1219198 1.7001993 0.0840843 -0.0001257 0.2770751 0.9683451 0.0045168 0.0009251 0.0045095 0.1615943 -0.0205336 0.0611069 0.0005619 0.0655746 0.0963303 -0.0008137 0.0004291 -0.0007117 0.2204132 -0.8007275 -0.163872 -0.0006487 0.0094696 -0.0400539 -0.000277 0.0002509 -0.0002122 0.005931 0.4744473 0.1416256 0.0006464 0.0664624 -0.0425543 0.001055 0.0002497 0.0009824 -0.2308118 0.4955842 -0.5068024 -0.0027995 -0.2860149 0.3216307 0.0027095 -0.0016471 0.0028279 -0.1753508 0.1692512 -0.1486105 -0.0010038 -0.241739 0.0521488 0.0007582 -0.0016868 0.0007362 -0.0608118 0.0490067 -0.0100811 -0.0248298 -0.0679267 0.0724754 -0.0662195 -0.0452643 -0.075804 0.0086707 0.0490645 -0.0103348 0.0246792 -0.0684174 0.0708168 0.0669946 0.0444271 0.076541 0.0103065 0.0753556 0.0267256 0.014017 -0.019157 0.0604 0.0619048 0.0206807 0.0698978 0.0147545 0.075124 0.0267529 -0.0137605 -0.0188429 0.062 -0.061316 -0.0209438 -0.0694234 0.01302 0.1189862 -0.0338963 -0.0001751 -0.0108319 0.0922603 -0.0006634 -0.0000452 -0.0006516 0.2155795 0.0600548 0.0239327 0.0001534 -0.0207969 0.0272808 -0.000914 -0.0001072 -0.0009621 0.1980988 unknown
polarizability: 150.6546541|-1.8803949|102.9662366|-0.0582582|0.3060125|49.4367946 unknown
InChI: InChI=1S/C7H6N2OS/c8-3-1-2-7(10)6-4-11-5-9-6/h4-5H,1-2H2
charge 0 multiplicity 1
17 atoms
S  -3.961179 -0.170655 -0.001552
O  0.142984 2.055319 0.009786
N  -1.50915 -1.22349 -0.007676
N  4.624898 -1.035802 -0.01132
C  1.188738 -0.159294 -0.003013
C  0.000225 0.798243 0.002844
C  2.529628 0.610985 0.001079
C  -1.355605 0.179959 -0.000093
C  -2.545479 0.903917 0.004137
C  -2.774079 -1.578265 -0.009259
C  3.687693 -0.297171 -0.005475
H  1.1082 -0.824999 -0.883421
H  1.10867 -0.835225 0.869627
H  2.583632 1.280708 -0.876725
H  2.584797 1.269342 0.88737
H  -2.650615 1.986772 0.010033
H  -3.148858 -2.601144 -0.014743
