program: Gaussian 09
title: 000131766
version: EM64L-G09RevD.01
frameworkgroup: C1[X(C5H10N2O2)]
method: RPBEPBE
basis: SDD
operation: Freq
keyword: #p
keyword: freq=noraman
keyword: PBEPBE/SDD
title: #p freq=noraman PBEPBE/SDD
converged: YES YES NO NO
title: Mulliken charges:
elementType: O O N N C C C C C H H H H H H H H H H
charge: -0.470670 -0.308284 -0.129176 -0.299993 -0.332826 -0.340921 -0.397834 -0.398012 0.232028 0.222867 0.254454 0.251299 0.227315 0.193945 0.218551 0.219652 0.196431 0.272839 0.388335
chargesum: 0.00000
title: Mulliken charges with hydrogens summed into heavy atoms:
elementType: O O N N C C C C C
charge: -0.082336 -0.308284 -0.129176 -0.027154 0.144495 0.137693 0.014661 0.018071 0.232028
polarizability: 8.96903781e+01 1.54719078e+00 7.54563367e+01 -3.95664707e+00 -4.52585908e-01 5.31911958e+01
1716.lowfreq: -27.3087 -8.7431 0.0003 0.0004 0.0010 2.1327 60.0828 108.5618 194.7270
frequency: 60.0195 108.5358 194.7072 264.9357 295.1663 349.6760 405.1366 446.1466 484.9038 509.0517 535.8729 570.5156 669.7978 690.7207 717.4241 843.5631 862.6621 910.8994 969.4476 1025.3936 1052.9938 1057.2864 1095.5326 1153.4129 1159.2762 1167.9244 1198.4281 1261.0215 1271.4720 1293.6992 1320.2354 1337.8466 1362.2422 1382.0119 1419.8978 1445.2337 1458.6041 1460.3852 1465.2466 1470.9141 1674.8067 2872.8959 2879.1222 2986.3604 2990.1555 3046.2281 3049.7648 3099.8633 3122.3920 3472.0310 3579.5520
redmass: 4.1660 6.5252 3.1623 2.4783 2.3963 4.3017 2.1289 2.8470 2.2324 1.1093 3.4307 2.9652 1.7252 8.7684 3.7345 1.5012 3.0671 2.4565 3.1699 2.4702 1.7042 1.9387 2.0200 2.0145 2.6669 1.7311 1.0934 2.0060 1.2967 1.4060 1.2257 1.2352 1.3745 1.4683 3.1640 1.3286 1.0833 1.0773 1.1131 1.1043 7.2480 1.0712 1.0697 1.0682 1.0669 1.0895 1.0914 1.0969 1.0945 1.0756 1.0647
irintensity: 0.2982 0.4413 1.7161 10.2639 1.5260 6.3952 5.1800 2.1389 119.3017 138.7005 27.0059 9.8224 60.8237 41.0010 0.4909 0.0822 13.0519 21.2127 24.3279 174.6065 1.6403 6.7964 72.0286 27.6063 99.5878 37.2359 2.7726 28.8256 5.4333 24.6213 42.6325 0.7196 8.8243 2.3609 122.0617 3.8461 8.7276 1.7695 31.9941 1.0080 483.9505 61.1257 133.7389 22.3242 63.4130 53.8839 41.6734 6.4591 5.0454 0.2689 49.4318
temp: 298.150 k
press: 1.00000 atm
elementType: 8 8 7 7 6 6 6 6 6 1 1 1 1 1 1 1 1 1 1
symmnumber: 1
zpe: 415830.4 jmol-1
zpe.correction: 0.158381 hartree
zpe.thermalcorrener: 0.166845 hartree
zpe.thermalcorrenthalpy: 0.167790 hartree
zpe.thermalcorrgfe: 0.125002 hartree
zpe.sumelectzpe: -455.764166 hartree
zpe.sumelectthermal: -455.755702 hartree
zpe.sumelectthermalent: -455.754758 hartree
zpe.sumelectthermalfe: -455.797546 hartree
dipole: -2.6471 -1.5658 -0.5924
dipole: 3.1320
quadrupole: -50.9736 -54.2237 -54.1389
quadrupole: -6.1820 2.6105 1.0912
quadrupole: 2.1385 -1.1116 -1.0268 -6.1820 2.6105 1.0912
hfenergy: -455.9225474 hartree
pointgroup: C01 [X(C5H10N2O2)]
dipole: 1.0565568 0.5870013 -0.2398671 debye
dipolederiv: -0.6592438 0.4166999 -0.0221532 0.6079614 -0.9945729 0.1281692 -0.0568097 0.111575 -0.4464904 -1.0066517 -0.278748 -0.1109242 -0.41736 -0.9239109 -0.0711641 -0.1606749 -0.0649109 -0.3957662 -1.3576803 -0.0506245 -0.1540563 -0.0362324 -0.5123032 -0.0092858 -0.1083573 -0.0057921 -0.3747184 -0.4322045 0.0014252 -0.1518089 0.001379 -0.5439193 -0.001009 -0.245424 -0.0020262 -0.5479922 0.2308768 0.2276609 0.0356658 0.3131196 0.3115188 0.0779871 0.0274971 0.0828928 0.3018179 0.2326856 -0.2237961 0.0431895 -0.342907 0.2845453 -0.0820289 0.0367512 -0.0808281 0.2885176 0.2357428 -0.2231386 0.1302472 -0.1738493 0.3643438 -0.0947739 0.0760335 -0.0353066 0.3484891 0.2360123 0.2207927 0.1239274 0.1692094 0.3808354 0.0931833 0.0691981 0.031302 0.3443155 2.1901391 0.0341476 0.3933039 0.0238261 1.4329372 -0.0069571 0.4873035 -0.0040302 0.3358771 0.001142 -0.0790089 -0.0564008 -0.0775916 0.0443821 0.0229744 -0.0587794 -0.0697142 -0.1650524 0.0651095 0.0746073 -0.0067521 0.0426483 -0.0140269 0.0178173 -0.0140891 0.0405654 0.0970656 0.067839 -0.0997885 -0.0048963 -0.0250991 -0.0066435 -0.0116289 -0.0105929 -0.0416226 0.0961408 0.005215 0.0686803 -0.0556883 0.0748525 0.056377 -0.0282365 -0.0546137 0.054264 -0.1619675 -0.0077996 0.1014472 -0.0911398 0.0417828 -0.0085847 -0.0139785 -0.0576295 0.1103386 -0.2542547 -0.0400886 -0.1216045 -0.0209269 -0.0909531 -0.1229933 -0.0211675 -0.0382353 -0.0425759 0.0791693 -0.0405169 0.1180821 -0.0231368 0.0899595 -0.1147112 0.0253037 -0.0421301 0.0469188 0.0782416 -0.0036279 -0.1015386 -0.0880355 -0.0422574 -0.01167 0.009129 -0.0532824 -0.1130243 -0.2474962 0.0621424 0.0009177 0.106957 0.0029554 0.088572 0.0028037 0.2529994 0.0037135 0.2378396 0.220909 -0.0862137 -0.0473719 -0.1614441 0.2898244 -0.0371375 -0.0491643 -0.021739 0.3862639 unknown
polarizability: 89.7335175|1.2712457|75.3963118|4.0492715|-0.0078279|53.2080813 unknown
InChI: InChI=1S/C5H10N2O2/c8-5(9)7-3-1-6-2-4-7/h6,8H,1-4H2
charge 0 multiplicity 1
19 atoms
O  -2.251956 1.206395 -0.237282
O  -2.347932 -1.13302 -0.243398
N  -0.349738 -0.003718 0.274808
N  2.460635 0.008244 -0.04989
C  0.401982 1.255268 0.473041
C  0.418405 -1.247429 0.503709
C  1.692032 1.229294 -0.375179
C  1.704967 -1.228757 -0.347109
C  -1.674037 -0.07853 -0.072973
H  0.679487 1.343478 1.542455
H  -0.239117 2.103564 0.194603
H  -0.224745 -2.102906 0.242996
H  0.693636 -1.310391 1.575028
H  1.404897 1.286372 -1.454683
H  2.301675 2.118515 -0.132482
H  2.324804 -2.105139 -0.085073
H  1.417185 -1.313665 -1.424267
H  3.405487 0.008934 -0.451544
H  -3.200468 1.061991 -0.48646
