program: Gaussian 09
title: 000131763
version: EM64L-G09RevD.01
frameworkgroup: C1[X(C22H23NO)]
method: RPBEPBE
basis: SDD
operation: Freq
keyword: #p
keyword: freq=noraman
keyword: PBEPBE/SDD
title: #p freq=noraman PBEPBE/SDD
converged: YES YES NO NO
title: Mulliken charges:
elementType: O N C C C C C C C C C C C C C C C C C C C C C C H H H H H H H H H H H H H H H H H H H H H H H
charge: -0.265645 -0.055042 0.332261 -0.527480 -0.533051 -0.399375 -0.398596 -0.061064 0.232637 0.187822 -0.622252 0.384658 0.386706 -0.542657 -0.394385 -0.439956 -0.444961 -0.435034 -0.438218 0.322756 -0.253672 -0.389966 -0.250009 -0.536464 0.237396 0.212497 0.211490 0.238791 0.189167 0.214496 0.214608 0.189724 0.186748 0.223517 0.223460 0.273084 0.248376 0.209396 0.208630 0.236640 0.239069 0.228074 0.241632 0.227088 0.222022 0.219775 0.245304
chargesum: 0.00000
title: Mulliken charges with hydrogens summed into heavy atoms:
elementType: O N C C C C C C C C C C C C C C C C C C C C C C
charge: -0.265645 -0.055042 0.332261 -0.077586 -0.082769 0.004288 0.005736 -0.061064 0.232637 0.187822 0.011473 0.384658 0.386706 -0.269573 -0.146009 -0.230560 -0.236331 -0.198394 -0.199149 0.322756 -0.025598 -0.148334 -0.022920 0.150637
polarizability: 3.10498001e+02 5.14443699e+01 2.64258295e+02 -1.60146885e+01 1.06651339e+01 2.18699078e+02
1716.lowfreq: -5.0652 -0.0003 0.0004 0.0008 6.5423 8.5286 31.7483 41.6544 57.2043
frequency: 31.6994 41.6346 57.1986 74.9564 82.4871 93.0796 108.1029 132.4205 167.1455 184.8522 197.2884 225.4733 228.4273 236.1397 241.9094 267.6428 295.1051 318.4082 318.7930 336.1703 357.6695 375.1284 408.7243 425.1748 433.3261 449.6965 465.5728 479.0442 493.8256 514.2690 528.3489 579.0905 598.4929 617.4647 643.9404 672.5486 685.6534 710.0000 720.6566 743.0267 751.1721 753.0967 764.6411 791.6061 802.8401 810.5541 819.5863 855.3885 866.9562 886.9718 905.2034 923.3631 937.2837 952.9071 957.6430 977.8617 985.8000 991.6856 1005.5531 1007.3236 1020.8609 1041.0887 1066.5589 1068.5212 1096.2570 1112.2518 1117.5646 1124.1966 1139.8169 1144.1157 1158.2516 1169.7779 1171.0469 1172.5631 1175.9002 1205.1784 1225.0452 1234.7434 1239.8234 1250.5633 1255.2820 1281.1350 1285.6823 1292.6827 1310.3038 1312.6542 1324.1785 1352.8809 1371.0994 1372.0349 1378.3250 1407.6604 1413.6585 1430.7356 1437.8419 1444.3682 1447.7191 1455.8778 1463.0176 1463.3743 1467.2994 1473.8292 1477.9401 1480.1776 1481.9603 1489.9097 1550.7888 1563.2955 1600.6914 1612.4742 1628.8586 1641.7734 2830.3263 2836.1809 2857.9265 2959.5069 2973.3080 2977.0222 3015.3167 3018.8915 3023.7389 3047.4925 3073.5754 3073.8816 3075.5112 3081.1575 3108.8820 3116.9407 3122.1949 3124.5938 3126.3268 3140.7481 3157.6326 3160.2841 3163.1562
redmass: 4.2058 4.1276 3.9931 2.9676 3.9711 3.8975 3.9629 4.1098 3.4114 2.6048 2.7499 1.6527 2.2786 1.7270 1.9178 3.3011 4.2195 3.1041 2.1017 2.9769 2.7919 2.9708 4.4659 3.4778 5.0475 2.4972 3.1403 3.1807 4.1483 4.2273 4.1042 3.7633 3.2808 5.0798 4.0652 5.6040 4.6846 4.1668 1.9116 3.1671 3.7084 3.6655 1.9448 1.6421 3.7565 1.6086 1.6849 3.3332 2.8748 1.7360 1.6004 2.9150 1.3993 1.9080 2.0449 1.3270 1.3224 2.3871 1.5453 3.7437 2.6976 2.3079 1.7969 2.0308 2.2487 1.2596 1.5660 1.7708 2.4327 1.5231 2.1413 1.8689 1.1209 1.0679 1.4543 2.2845 2.2138 2.3349 1.3961 1.6112 1.7290 1.7024 1.4906 1.4472 2.2951 1.5409 1.3892 1.4233 1.4055 9.2041 4.9107 1.8310 2.6251 1.1743 1.2303 1.1326 2.1659 1.0968 1.0751 1.0508 1.0505 1.0831 2.3437 1.1403 1.0548 3.1680 6.9922 6.6765 6.0340 6.6226 7.1470 9.0047 1.0714 1.0671 1.0591 1.0329 1.0658 1.0658 1.0725 1.0877 1.0895 1.1039 1.0978 1.0969 1.0945 1.0837 1.0942 1.0863 1.0898 1.0984 1.0881 1.0940 1.0916 1.1007 1.0943
irintensity: 0.2001 1.1210 0.1653 0.1416 0.4913 4.5429 1.8142 1.2944 1.0701 1.0042 0.9032 0.2503 0.7133 1.9034 1.3127 1.4360 1.3943 7.3565 1.5308 5.0324 5.2463 0.0449 2.1253 6.8873 1.5246 0.5555 1.2238 8.1086 15.4125 3.2978 4.6446 0.7755 0.7009 7.5048 0.1590 6.5848 2.5607 1.8365 0.7059 15.2747 7.0479 1.5961 50.5757 15.6976 1.8436 1.2132 68.6392 23.8457 4.7677 9.7696 14.0541 0.3138 2.5382 13.0084 8.6292 1.2479 0.1875 39.1771 2.4338 45.7667 6.3173 4.6675 12.4199 2.9468 13.3419 0.1881 26.0888 36.7420 37.5220 7.1317 0.7364 9.0616 5.1369 1.4231 13.1888 98.9949 3.0729 47.1685 5.7767 3.2484 48.5842 5.3266 48.7665 23.6932 19.1982 1.5027 8.3805 1.3074 13.0859 0.8561 9.5081 23.4574 23.9871 3.1450 2.2184 6.2902 4.7456 6.9141 0.3104 26.5165 13.0703 52.0588 10.9155 10.4798 7.0147 53.9132 55.3142 2.2859 8.5300 137.6849 5.9199 17.8717 42.8434 46.7933 201.0103 94.9258 4.2195 35.5984 47.9685 53.5521 70.5836 47.2027 1.6862 51.6496 12.2446 0.7568 30.8833 10.4226 32.1476 12.9993 3.3296 28.9386 2.5259 41.8122 19.3176
temp: 298.150 k
press: 1.00000 atm
elementType: 8 7 6 6 6 6 6 6 6 6 6 6 6 6 6 6 6 6 6 6 6 6 6 6 1 1 1 1 1 1 1 1 1 1 1 1 1 1 1 1 1 1 1 1 1 1 1
symmnumber: 1
zpe: 1024339.9 jmol-1
zpe.correction: 0.390150 hartree
zpe.thermalcorrener: 0.411059 hartree
zpe.thermalcorrenthalpy: 0.412003 hartree
zpe.thermalcorrgfe: 0.340927 hartree
zpe.sumelectzpe: -980.358373 hartree
zpe.sumelectthermal: -980.337465 hartree
zpe.sumelectthermalent: -980.336521 hartree
zpe.sumelectthermalfe: -980.407597 hartree
dipole: -1.5458 -0.4405 1.3343
dipole: 2.0890
quadrupole: -117.8731 -138.5654 -136.1659
quadrupole: 7.3257 -3.0226 -0.5156
quadrupole: 12.9950 -7.6972 -5.2978 7.3257 -3.0226 -0.5156
hfenergy: -980.7485238 hartree
pointgroup: C01 [X(C22H23N1O1)]
dipole: 0.6516321 -0.0101443 -0.5007246 debye
polarizability: 331.6283465|-35.049451|245.2570807|-10.2797174|-14.2303895|216.5699462 unknown
InChI: InChI=1S/C22H23NO/c1-23-13-11-18(12-14-23)22-20-6-4-3-5-16(20)7-8-17-9-10-19(24-2)15-21(17)22/h3-10,15H,11-14H2,1-2H3
charge 0 multiplicity 1
47 atoms
O  4.381032 -0.302473 1.536484
N  -1.997082 -3.819855 -0.274873
C  -0.817451 -1.249417 0.501871
C  0.03594 -2.49921 0.332221
C  -2.270957 -1.585151 0.808447
C  -0.610791 -3.484906 -0.672998
C  -2.837851 -2.602729 -0.212237
C  -0.350868 0.031236 0.318766
C  1.081724 0.326969 -0.012995
C  -1.233718 1.235704 0.461254
C  -2.588668 -4.867079 -1.12906
C  1.432573 0.966541 -1.251531
C  -1.491112 2.099321 -0.654239
C  2.105491 -0.060325 0.878512
C  -1.868692 1.507995 1.701383
C  0.450576 1.494667 -2.2052
C  -0.811992 1.977952 -1.951401
C  2.813283 1.105338 -1.5673
C  -2.44692 3.147801 -0.500189
C  3.470485 0.130105 0.559498
C  -2.781217 2.574107 1.846684
C  3.834315 0.70395 -0.685021
C  -3.085286 3.390076 0.730242
C  5.808088 -0.126597 1.256947
H  1.056269 -2.255029 -0.005752
H  0.118018 -3.020752 1.307577
H  -2.333549 -2.048817 1.814104
H  -2.906866 -0.684862 0.81123
H  -0.578227 -3.03003 -1.698366
H  -0.01901 -4.419265 -0.704174
H  -3.860193 -2.897627 0.091383
H  -2.914669 -2.10549 -1.215258
H  -2.688149 -4.561828 -2.202385
H  -3.595131 -5.128258 -0.754958
H  -1.96245 -5.776773 -1.090548
H  1.853845 -0.528262 1.835068
H  -1.642607 0.86037 2.556121
H  0.820982 1.611335 -3.234086
H  -1.342483 2.436446 -2.798181
H  3.089467 1.565471 -2.523915
H  -2.66539 3.79056 -1.361959
H  -3.26025 2.758868 2.81455
H  4.88211 0.845428 -0.965291
H  -3.805767 4.210169 0.82391
H  6.062354 0.94233 1.118833
H  6.118334 -0.700537 0.361959
H  6.324759 -0.518669 2.145273
