program: Gaussian 09
title: 000131755
version: EM64L-G09RevD.01
frameworkgroup: C1[X(C14H10Cl2O4)]
method: RPBEPBE
basis: SDD
operation: Freq
keyword: #p
keyword: freq=noraman
keyword: PBEPBE/SDD
title: #p freq=noraman PBEPBE/SDD
converged: YES YES NO NO
title: Mulliken charges:
elementType: Cl Cl O O O O C C C C C C C C C C C C C C H H H H H H H H H H
charge: -0.015426 -0.046186 -0.294369 -0.433561 -0.409801 -0.248159 0.325132 0.140424 -0.567494 -0.555435 -0.330754 0.304769 -0.357603 0.500479 -0.318005 -0.322457 0.185988 -0.194538 -0.210460 -0.113835 0.290191 0.280724 0.292972 0.270489 0.259225 0.282465 0.281744 0.260325 0.360861 0.382294
chargesum: 0.00000
title: Mulliken charges with hydrogens summed into heavy atoms:
elementType: Cl Cl O O O O C C C C C C C C C C C C C C
charge: -0.015426 -0.046186 -0.294369 -0.072700 -0.027506 -0.248159 0.325132 0.140424 0.003422 -0.262463 -0.060265 0.304769 -0.098378 0.500479 -0.318005 -0.039992 0.185988 0.087206 0.049865 -0.113835
polarizability: 2.67439438e+02 -1.23045493e+01 1.76376094e+02 5.10988204e+00 1.45678355e+01 1.21724589e+02
1716.lowfreq: -5.3824 -2.3444 -0.0016 -0.0013 0.0001 5.2763 10.3320 18.9659 23.3609
frequency: 9.9387 18.9581 23.3360 36.3204 45.0696 93.6983 122.6476 138.6419 158.8884 165.6721 192.5495 212.7276 230.0272 292.1208 309.2806 328.0010 364.8550 372.0151 373.7334 403.9129 422.6927 432.1392 440.2039 476.0569 489.1445 539.5625 555.2226 570.3177 579.8361 632.0346 639.8827 642.6154 671.7124 696.8638 726.4819 732.2475 772.4561 809.2925 827.1633 854.4425 862.2794 873.4907 881.1240 938.6083 949.2464 955.5853 957.7962 1027.6080 1048.1960 1079.7840 1082.4341 1132.9390 1143.3375 1160.1746 1188.8796 1209.6723 1223.7558 1241.9143 1247.9464 1267.3140 1306.4382 1356.5054 1366.3802 1385.7052 1395.1166 1412.2079 1439.6080 1455.3196 1493.5021 1571.1386 1590.9048 1613.4765 1616.7653 1666.9525 2985.6390 3048.5128 3143.9152 3154.3770 3159.7074 3179.2992 3180.3766 3182.3173 3514.7181 3581.5135
redmass: 8.9651 7.5353 10.8025 3.7069 8.2772 7.4575 8.2461 6.7320 9.8523 5.7780 3.7098 8.4391 10.0231 7.3421 8.3391 7.4875 6.9239 5.0475 1.2485 7.6110 7.9561 2.6623 3.1892 5.0341 2.3233 4.8432 4.7973 5.0401 3.3391 3.3990 5.6349 1.7883 5.7990 4.3895 6.9641 5.0574 6.8295 1.3978 1.4269 6.7604 1.3859 3.5386 1.6886 1.3996 1.6668 2.0625 2.4432 4.1861 2.3370 2.7960 2.2409 1.6019 1.3232 1.4107 1.8280 1.1300 2.5151 1.8359 1.4209 1.8840 2.1904 4.7590 3.0391 5.3290 3.8429 1.4686 1.9484 2.6402 3.0695 7.9481 7.6257 7.5065 6.3618 8.0354 1.0680 1.0887 1.0922 1.0892 1.0884 1.0962 1.0967 1.0942 1.0640 1.0661
irintensity: 0.1231 0.2177 0.7667 2.1601 0.2535 0.1861 1.9433 0.8142 1.7356 0.4344 2.4246 1.2464 2.7406 5.4147 3.0332 2.9865 11.8813 21.2325 118.7530 5.4522 7.8443 33.0407 6.7050 14.6120 1.8115 11.0975 12.0613 39.1673 32.8179 28.1331 14.8195 97.1973 14.5242 10.1512 44.6529 18.7574 31.7021 55.6157 22.1175 15.6826 20.8806 8.4633 14.3581 1.6540 10.4910 7.4693 7.6638 76.1890 380.6769 68.8000 25.9961 218.5890 16.5738 118.9849 8.2764 10.4482 244.2464 48.6583 51.1477 3.8392 15.5992 18.2270 54.9548 3.9825 68.0108 3.6828 172.0735 290.2068 121.7030 23.3328 5.6866 10.6300 39.2573 159.2602 6.6063 1.3761 18.0908 7.6636 0.9720 0.4254 3.1928 0.8296 32.1067 53.1557
temp: 298.150 k
press: 1.00000 atm
elementType: 17 17 8 8 8 8 6 6 6 6 6 6 6 6 6 6 6 6 6 6 1 1 1 1 1 1 1 1 1 1
symmnumber: 1
zpe: 542358.4 jmol-1
zpe.correction: 0.206573 hartree
zpe.thermalcorrener: 0.225271 hartree
zpe.thermalcorrenthalpy: 0.226216 hartree
zpe.thermalcorrgfe: 0.155066 hartree
zpe.sumelectzpe: -1759.074614 hartree
zpe.sumelectthermal: -1759.055916 hartree
zpe.sumelectthermalent: -1759.054972 hartree
zpe.sumelectthermalfe: -1759.126122 hartree
dipole: 1.8128 0.3720 -1.3626
dipole: 2.2982
quadrupole: -129.2975 -125.2233 -129.5016
quadrupole: 7.8464 -4.3373 -1.3772
quadrupole: -1.2900 2.7841 -1.4942 7.8464 -4.3373 -1.3772
hfenergy: -1759.2811877 hartree
pointgroup: C01 [X(C14H10Cl2O4)]
dipole: -0.7258718 -0.2171905 -0.4934107 debye
polarizability: 266.1142017|-17.316432|170.0573511|-4.413377|-23.6384585|129.3685678 unknown
InChI: InChI=1S/C14H10Cl2O4/c15-9-1-3-13(11(16)7-9)20-12-4-2-10(17)5-8(12)6-14(18)19/h1-5,7,17-18H,6H2
charge 0 multiplicity 1
30 atoms
Cl 2.39468 -1.685422 2.402443
Cl 6.011079 0.008443 -1.460191
O  0.381091 -0.340092 0.684122
O  -3.912646 3.119911 -0.412816
O  -3.008503 -3.599227 -0.671715
O  -4.344841 -1.720823 -0.86109
C  -1.924506 -0.037071 0.016427
C  -0.673108 0.556938 0.325678
C  -1.999523 -1.556109 0.012328
C  -3.019882 0.824893 -0.228377
C  -0.509977 1.955574 0.409979
C  -2.854768 2.228713 -0.167572
C  -1.604448 2.802251 0.154893
C  1.672129 -0.177919 0.159386
C  2.735764 -0.80114 0.858999
C  1.952928 0.498051 -1.052952
C  -3.24106 -2.221471 -0.5489
C  4.056503 -0.752821 0.375857
C  3.271515 0.55919 -1.551331
C  4.305197 -0.065889 -0.828554
H  -1.880331 -1.93524 1.048527
H  -1.126904 -1.979174 -0.517557
H  -3.99169 0.383528 -0.473302
H  0.461622 2.377821 0.684393
H  -1.510544 3.889873 0.212622
H  1.138164 0.970325 -1.609146
H  4.86478 -1.237114 0.929291
H  3.48385 1.080167 -2.488702
H  -4.745467 2.628967 -0.623537
H  -3.833903 -4.042033 -1.009902
