program: Gaussian 09
title: 000131748
version: EM64L-G09RevD.01
frameworkgroup: C1[X(C11H16ClNO3)]
method: RPBEPBE
basis: SDD
operation: Freq
keyword: #p
keyword: freq=noraman
keyword: PBEPBE/SDD
title: #p freq=noraman PBEPBE/SDD
converged: YES YES NO NO
title: Mulliken charges:
elementType: Cl O O O N C C C C C C C C C C C H H H H H H H H H H H H H H H H
charge: -0.081077 -0.477113 -0.430293 -0.482565 -0.400785 -0.187091 -0.436296 -0.034912 0.625527 -0.661019 -0.709076 -0.503757 -0.377167 0.176192 -0.344027 0.153956 0.225891 0.239275 0.232860 0.201162 0.275891 0.209309 0.218382 0.224956 0.210687 0.221520 0.224446 0.314151 0.364652 0.248822 0.382661 0.374839
chargesum: 0.00000
title: Mulliken charges with hydrogens summed into heavy atoms:
elementType: Cl O O O N C C C C C C C C C C C
charge: -0.081077 -0.112461 -0.047632 -0.107726 -0.124894 0.038800 0.035839 0.166250 0.625527 -0.008373 -0.052423 -0.189607 -0.377167 0.176192 -0.095205 0.153956
polarizability: 1.94521439e+02 1.18834505e+01 1.60534975e+02 1.31608197e+01 -4.66790864e+00 9.39026637e+01
1716.lowfreq: -16.7178 -4.2820 -0.0016 -0.0014 0.0015 5.8122 16.1715 24.8287 50.6588
frequency: 12.8305 23.9515 50.6164 60.1785 96.1848 116.5130 157.3695 194.3407 199.0968 212.5822 229.3826 241.9917 244.9032 265.1918 279.5755 313.7617 342.7197 356.9034 366.0277 391.5201 426.9179 440.0463 472.7753 475.9872 493.0509 554.7562 579.6466 622.0923 644.1550 668.0723 702.9269 745.1568 794.0204 810.5393 812.6470 816.5328 869.8191 914.5176 915.4261 933.8720 952.8627 980.9756 1021.3315 1048.4277 1076.5918 1085.9547 1128.5527 1137.0100 1151.8984 1167.0253 1179.5392 1200.2881 1225.2570 1259.4278 1277.7362 1288.1509 1301.9312 1310.5842 1331.3870 1351.2379 1379.1843 1393.9626 1395.0641 1401.4750 1442.8420 1446.6066 1457.0194 1464.7609 1474.4026 1479.0872 1487.2220 1489.9435 1595.9174 1630.1643 2898.0608 2938.1811 2975.6114 2979.6184 2983.4944 3067.7762 3069.2675 3080.8832 3085.0852 3091.5728 3150.0500 3163.9505 3182.7138 3435.3428 3528.7508 3625.1717
redmass: 3.4993 3.1318 4.2952 4.3796 5.0669 4.6104 7.1282 4.3673 1.7111 2.0080 3.1705 1.1624 1.2892 3.2518 5.2350 3.5434 5.7118 10.8613 3.0504 4.7018 2.2778 2.9215 1.1385 2.6947 3.3069 6.0063 3.6804 6.4192 3.0184 2.0464 3.7272 4.2430 3.7489 1.4529 1.2392 2.4341 2.9651 1.2157 1.3859 1.9034 1.4928 3.2544 3.4192 2.9929 2.9949 2.1030 1.8350 1.6660 1.7896 1.7330 2.0687 1.3980 1.3472 1.8181 1.2294 2.8240 1.2267 1.2877 1.4173 1.3183 1.2326 1.2278 1.6018 4.1497 1.4796 2.2300 1.0891 1.0515 1.0971 1.0645 1.0555 3.8230 7.5650 7.5055 1.0833 1.0831 1.0364 1.0631 1.0367 1.0994 1.0988 1.0992 1.0998 1.0991 1.0924 1.0631 1.0915 1.0746 1.0649 1.0667
irintensity: 0.2494 0.4299 1.8336 4.3231 1.0696 2.5517 0.9322 1.6333 2.8105 1.4275 6.6745 11.2421 137.2292 20.9784 7.0701 3.0944 11.8639 1.4654 5.2630 2.6650 0.4915 26.0088 121.1294 5.0302 9.1801 18.7417 22.6873 4.7578 4.8026 29.0184 4.4678 4.6577 62.2368 62.1890 123.0466 6.9352 23.0885 4.8337 43.0107 1.5398 3.9410 5.3169 29.3004 100.7214 14.0473 125.4734 1.4793 124.1334 53.2469 5.9851 47.3968 43.7649 8.4175 198.0028 29.8785 20.9994 53.8721 26.7939 18.1250 17.7116 17.5071 31.7644 124.5676 18.5804 25.1861 7.2481 4.8189 0.2566 7.5281 12.2764 16.4488 159.2572 18.3945 7.2691 69.3299 33.5430 34.5874 34.1171 10.8257 10.2447 39.9477 28.8948 26.1896 65.1948 4.7905 270.1361 4.3176 0.0829 85.1658 63.1047
temp: 298.150 k
press: 1.00000 atm
elementType: 17 8 8 8 7 6 6 6 6 6 6 6 6 6 6 6 1 1 1 1 1 1 1 1 1 1 1 1 1 1 1 1
symmnumber: 1
zpe: 670614.3 jmol-1
zpe.correction: 0.255423 hartree
zpe.thermalcorrener: 0.272925 hartree
zpe.thermalcorrenthalpy: 0.273870 hartree
zpe.thermalcorrgfe: 0.208250 hartree
zpe.sumelectzpe: -1167.998650 hartree
zpe.sumelectthermal: -1167.981148 hartree
zpe.sumelectthermalent: -1167.980204 hartree
zpe.sumelectthermalfe: -1168.045824 hartree
dipole: 0.4333 2.0486 -3.2138
dipole: 3.8358
quadrupole: -69.3116 -108.7450 -108.2442
quadrupole: -2.5178 3.8770 2.4154
quadrupole: 26.1220 -13.3114 -12.8106 -2.5178 3.8770 2.4154
hfenergy: -1168.2540737 hartree
pointgroup: C01 [X(C11H16Cl1N1O3)]
dipole: -0.1753973 0.4391733 1.4331059 debye
polarizability: 194.2317523|-15.3352091|153.5383839|10.1244859|21.0433606|101.1889416 unknown
InChI: InChI=1S/C11H16ClNO3/c1-6(2)13-5-11(16)7-3-9(14)10(15)4-8(7)12/h3-4,6,11,13-16H,5H2,1-2H3
charge 0 multiplicity 1
32 atoms
Cl 0.924561 2.933813 0.909493
O  -1.268814 -0.063556 -1.769119
O  2.951849 -2.490157 -0.780558
O  4.594439 -0.851205 0.606489
N  -3.146463 0.530868 -0.000461
C  -0.786108 0.780261 -0.683847
C  -1.758666 0.574986 0.529717
C  -4.118047 -0.368794 0.697366
C  0.646466 0.409557 -0.33286
C  -3.834952 -1.845289 0.346135
C  -5.546266 0.034176 0.278563
C  1.158005 -0.854691 -0.720003
C  1.504079 1.267854 0.387797
C  2.466625 -1.239628 -0.38714
C  2.824987 0.915136 0.735115
C  3.299435 -0.348738 0.342622
H  -0.818691 1.850104 -0.986203
H  -1.597313 1.362101 1.293193
H  -1.533952 -0.401878 0.991643
H  -4.030312 -0.247373 1.803217
H  -3.53758 1.476244 -0.116347
H  -4.517683 -2.510074 0.906372
H  -3.984797 -2.014662 -0.735501
H  -2.799696 -2.138904 0.594804
H  -5.777208 1.075559 0.574817
H  -6.290974 -0.625726 0.756657
H  -5.661423 -0.050532 -0.817872
H  0.518369 -1.51323 -1.312514
H  -2.267129 -0.084488 -1.588425
H  3.456826 1.614642 1.292466
H  3.893978 -2.578961 -0.478221
H  5.159954 -0.197214 1.081605
