program: Gaussian 09
title: 000131743
version: EM64L-G09RevD.01
frameworkgroup: C1[X(C10H18N6OS)]
method: RPBEPBE
basis: SDD
operation: Freq
keyword: #p
keyword: freq=noraman
keyword: PBEPBE/SDD
title: #p freq=noraman PBEPBE/SDD
converged: YES YES NO NO
title: Mulliken charges:
elementType: S O N N N N N N C C C C C C C C C C H H H H H H H H H H H H H H H H H H
charge: 0.153180 -0.313946 -0.375827 -0.385798 -0.092901 -0.487375 -0.169569 -0.652068 -0.774405 0.146707 -0.660658 -0.349181 0.231020 -0.793161 -0.255707 0.350021 0.307817 -0.728480 0.271448 0.305351 0.250535 0.246463 0.272397 0.215245 0.355780 0.299607 0.288532 0.216949 0.233946 0.255378 0.323186 0.255013 0.209169 0.186736 0.352086 0.312508
chargesum: 0.00000
title: Mulliken charges with hydrogens summed into heavy atoms:
elementType: S O N N N N N N C C C C C C C C C C
charge: 0.153180 -0.313946 -0.020047 -0.086190 -0.092901 -0.164188 -0.169569 0.012526 -0.197606 0.146707 -0.163660 0.138461 0.231020 -0.053734 -0.000329 0.350021 0.307817 -0.077562
polarizability: 2.08694494e+02 9.78402676e+00 1.85901013e+02 -1.49085139e+01 2.69268505e+00 1.25258907e+02
1716.lowfreq: -9.7941 -5.3018 -0.0012 -0.0010 0.0013 4.4492 16.2482 21.3788 36.2622
frequency: 14.8638 20.7976 36.1884 49.5714 65.8113 70.1247 76.3433 105.4195 111.0988 115.3918 135.6050 171.2877 177.0066 207.9646 220.9354 226.0506 255.6232 283.4590 304.1326 313.6197 320.2669 364.8654 394.9628 454.1577 493.0104 513.5533 567.6183 597.3775 611.2575 618.8483 632.2792 640.5132 650.4478 676.5138 679.0794 696.1105 723.5197 743.0186 746.6014 768.0356 795.1696 862.8578 895.4272 917.9150 947.3098 975.9779 977.2642 1021.6549 1047.1951 1047.9151 1055.2250 1069.4678 1071.0227 1098.2809 1116.8327 1156.0010 1183.6336 1209.2376 1232.0592 1235.5907 1260.1472 1280.1914 1286.7756 1303.4101 1321.8272 1333.7360 1359.1372 1399.8434 1407.9152 1420.0599 1425.4357 1444.0963 1447.6881 1458.1957 1465.2094 1472.3449 1484.1794 1487.3674 1493.9247 1552.0605 1592.1001 1608.2619 1651.9228 1672.3060 2861.5353 2929.8950 2957.8817 2963.5606 3000.7509 3003.3605 3035.2414 3062.8492 3065.5543 3083.9891 3090.0874 3094.0586 3234.8159 3375.2765 3539.6623 3549.2179 3581.1420 3695.4635
redmass: 4.9571 5.0945 5.5976 4.1118 4.2282 5.5576 4.9332 1.6893 2.4717 1.5080 1.6194 3.4407 3.2251 3.2159 3.4438 3.2909 2.5111 2.6896 1.7383 2.4763 4.9578 4.3638 2.6372 3.6009 3.0438 1.1608 1.2004 3.5979 4.9330 2.7531 3.3088 5.0070 1.4442 7.3453 5.4855 2.1624 4.8015 1.9068 3.7330 1.5049 3.0521 2.3107 1.6710 6.2403 2.2608 3.5498 1.7593 2.5574 1.7936 1.5368 1.8552 1.6123 1.3780 1.6992 1.6837 3.2940 1.7262 1.3853 1.2899 1.6774 1.2660 1.9989 3.7201 1.2915 2.2509 2.4156 1.2829 4.1515 1.3336 1.3272 1.0939 1.5520 1.6716 1.1321 1.0921 1.0795 1.2880 1.3318 1.1418 1.8918 5.8729 1.2613 3.2016 4.1156 1.0452 1.0934 1.0686 1.0380 1.0595 1.0603 1.0986 1.0898 1.1007 1.0970 1.0970 1.1063 1.0983 1.0814 1.0552 1.0662 1.0817 1.1044
irintensity: 0.5593 0.4755 7.9059 3.3881 2.7733 5.6330 2.3849 3.1570 3.8593 3.1685 0.5218 3.8599 9.9767 4.3259 1.2414 2.9468 5.9442 6.5647 13.2913 11.3904 5.0994 8.0343 12.0036 4.2387 1.6030 328.3147 42.5342 15.2004 1.2372 51.8455 32.4567 7.7794 31.0662 28.7989 7.2229 4.1854 20.3065 133.2991 45.8134 23.1810 12.8490 5.1239 0.2516 2.5434 4.9299 2.7691 0.3338 7.7219 7.3943 6.9490 1.9470 14.1532 3.0477 14.2939 18.3144 30.4405 5.6290 12.5488 32.2779 20.7738 14.1905 50.9563 12.8263 64.4730 237.0859 12.2029 8.8834 7.5538 2.6774 44.6927 25.4604 156.2914 96.4112 19.6852 7.0478 23.6954 4.9907 102.1502 41.5954 384.8322 16.7500 111.1996 111.7830 532.3489 125.1921 95.1977 53.1322 45.7413 68.6095 14.9540 20.9432 30.2750 3.8927 18.6661 5.1909 3.9735 3.5396 249.2828 56.2619 25.7601 31.4241 40.3442
temp: 298.150 k
press: 1.00000 atm
elementType: 16 8 7 7 7 7 7 7 6 6 6 6 6 6 6 6 6 6 1 1 1 1 1 1 1 1 1 1 1 1 1 1 1 1 1 1
symmnumber: 1
zpe: 762750.0 jmol-1
zpe.correction: 0.290516 hartree
zpe.thermalcorrener: 0.310998 hartree
zpe.thermalcorrenthalpy: 0.311942 hartree
zpe.thermalcorrgfe: 0.238243 hartree
zpe.sumelectzpe: -1192.286246 hartree
zpe.sumelectthermal: -1192.265764 hartree
zpe.sumelectthermalent: -1192.264820 hartree
zpe.sumelectthermalfe: -1192.338519 hartree
dipole: 3.4024 -7.6373 -0.4743
dipole: 8.3743
quadrupole: -100.3962 -94.5934 -119.1438
quadrupole: -0.0479 2.5441 8.9444
quadrupole: 4.3149 10.1177 -14.4327 -0.0479 2.5441 8.9444
hfenergy: -1192.5767624 hartree
pointgroup: C01 [X(C10H18N6O1S1)]
dipole: 1.4148521 -2.8795192 0.7494884 debye
polarizability: 194.4498247|-4.4813048|177.0963734|-35.0779593|-19.7810258|148.3082166 unknown
InChI: InChI=1S/C10H18N6OS/c1-7-8(15-6-14-7)5-18-4-3-13-10(12-2)16-9(11)17/h6,13-14,16H,3-5,11H2,1-2H3
charge 0 multiplicity 1
36 atoms
S  -1.132459 1.217658 -1.206003
O  3.847546 -0.037328 -2.353272
N  2.165486 1.224814 -0.639487
N  -4.178488 -1.352546 1.175659
N  -4.149883 0.898454 1.006726
N  3.116645 -0.923927 -0.287915
N  1.61429 0.045807 1.339096
N  4.589602 -2.12789 -1.670501
C  -1.669083 1.297622 0.636517
C  -2.83673 0.39667 0.86862
C  0.135615 2.61466 -1.210985
C  1.36604 2.399422 -0.300349
C  -2.833041 -1.003786 0.969695
C  -1.717469 -2.002439 0.871588
C  -4.93094 -0.17937 1.193341
C  2.251738 0.128009 0.187621
C  3.846182 -0.968615 -1.485754
C  1.837956 -1.112079 2.219492
H  -1.956907 2.339412 0.851038
H  -0.783655 1.002434 1.225724
H  0.438766 2.706099 -2.269683
H  -0.378365 3.549264 -0.91752
H  1.059568 2.29608 0.753115
H  2.002573 3.306645 -0.377632
H  2.676346 1.165846 -1.53298
H  -4.533485 -2.301193 1.290901
H  -0.763785 -1.462164 0.752933
H  -1.645078 -2.638768 1.775389
H  -1.832769 -2.668469 -0.005339
H  -6.007834 -0.164191 1.34432
H  3.165105 -1.731239 0.335073
H  1.208765 -0.992922 3.117418
H  2.890773 -1.199606 2.576872
H  1.55319 -2.093989 1.766633
H  5.125301 -2.192971 -2.532865
H  4.629181 -2.896705 -1.005085
