program: Gaussian 09
title: 000131742
version: EM64L-G09RevD.01
frameworkgroup: C1[X(C15H11I4NO7S)]
method: RPBEPBE
basis: SDD
operation: Freq
keyword: #p
keyword: freq=noraman
keyword: PBEPBE/SDD
title: #p freq=noraman PBEPBE/SDD
converged: YES YES NO NO
title: Mulliken charges:
elementType: I I I I S O O O O O O O N C C C C C C C C C C C C C C C H H H H H H H H H H H
charge: 0.165803 0.188167 0.226071 0.180644 1.083296 -0.253004 -0.409530 -0.271467 -0.248458 -0.549326 -0.476522 -0.496984 -0.552981 -0.588091 0.508999 -0.199404 -0.365816 -0.338406 0.521343 -0.497258 -0.487532 0.187682 0.350273 -0.300983 -0.197060 0.462968 -0.469060 -0.409503 0.251346 0.238868 0.272697 0.264525 0.296035 0.285735 0.297669 0.289458 0.290679 0.381170 0.367954
chargesum: 0.00000
title: Mulliken charges with hydrogens summed into heavy atoms:
elementType: I I I I S O O O O O O O N C C C C C C C C C C C C C C C
charge: 0.165803 0.188167 0.226071 0.180644 1.083296 -0.253004 -0.028359 -0.271467 -0.248458 -0.181372 -0.476522 -0.496984 0.030424 -0.097877 0.508999 0.073293 -0.101291 -0.042370 0.521343 -0.497258 -0.487532 0.187682 0.350273 -0.011525 0.093619 0.462968 -0.469060 -0.409503
polarizability: 5.23152788e+02 2.65494904e+01 3.56103992e+02 2.52983193e+01 1.98825464e+01 2.68833484e+02
1716.lowfreq: -5.6004 -5.0226 -0.0015 -0.0012 -0.0007 1.8375 5.0011 8.8842 11.9245
frequency: 4.2248 8.7455 11.9210 16.0984 19.1556 27.0666 31.4458 39.4845 47.1772 51.8301 54.5764 65.6106 67.2478 79.8514 92.7415 103.2591 117.3405 126.8128 133.1620 168.4950 172.6798 181.3341 203.5677 204.7147 222.7309 237.6884 240.5189 249.0330 258.1562 264.7439 269.2449 273.6677 308.4152 315.9356 342.6549 359.0982 369.5211 395.7403 408.0835 448.4109 486.4913 494.5576 504.2403 516.0243 526.4746 539.1490 563.7617 581.7656 584.5244 586.0422 626.0143 649.3988 681.4896 691.4711 703.2952 711.1223 751.5835 762.1359 780.5017 811.2709 821.9496 865.4703 866.5736 875.5214 892.3135 900.6595 915.0980 918.2008 954.9031 994.1182 1016.2652 1028.8922 1048.6659 1083.1243 1099.4060 1131.0950 1156.5945 1179.4386 1196.6150 1202.0570 1208.6328 1226.5703 1246.5225 1303.1694 1309.8102 1313.6652 1341.4507 1352.1710 1366.1065 1380.1574 1380.9468 1419.9728 1430.1029 1466.0550 1478.5531 1540.5106 1567.9535 1580.3383 1636.1995 1644.9180 3010.1050 3057.3476 3081.1100 3154.0501 3168.0036 3177.3151 3183.5778 3394.4413 3465.5365 3499.0761 3598.9730
redmass: 17.8961 21.6533 11.5151 9.2379 27.4566 11.7161 8.1229 37.3259 14.6689 8.0051 16.5216 7.9254 16.1813 10.4038 15.9540 15.6492 12.0045 15.0891 10.0030 4.7251 4.7199 6.0742 10.1253 8.8536 6.9253 6.9336 4.7916 4.6348 3.3125 3.3906 7.0899 3.5509 1.5470 2.4027 6.8311 3.4726 7.2756 8.6814 9.0878 4.8736 5.4036 5.2534 7.4980 5.7844 7.2185 7.5307 5.3908 1.5063 2.7869 3.4957 1.5879 3.1630 7.5132 8.8399 5.4990 4.7311 7.7162 7.4390 3.6139 6.2457 17.1455 1.4035 3.8160 1.4806 2.4977 3.8909 1.3630 10.3482 1.8147 2.8434 3.1988 4.0366 2.1707 1.1694 3.0938 1.3500 2.1598 2.5458 1.7639 1.6520 1.6026 4.2769 1.5618 3.0607 3.5488 1.4486 2.0599 4.1891 1.3953 2.2547 3.9164 3.7544 5.8657 1.0991 9.4077 7.9722 6.4981 6.8750 1.1688 5.4879 1.0610 1.0867 1.1014 1.0925 1.0933 1.0927 1.0937 1.0664 1.0448 1.0640 1.0991
irintensity: 0.5882 0.1465 0.4579 0.1127 0.6981 1.4569 1.1344 0.1053 0.9441 1.4537 1.3993 2.6507 0.2724 4.6941 5.4454 3.8567 5.3612 2.6858 1.0013 0.3055 0.1661 0.8108 17.3460 6.2509 2.7669 13.0652 9.1359 6.8030 22.0030 17.7253 1.3578 25.2061 35.2384 37.6023 17.3249 9.9174 68.9109 8.1490 7.3124 6.2363 5.9181 1.5620 42.0275 14.3728 171.2745 20.8190 10.4736 248.2752 46.5006 5.2008 101.8183 55.2886 16.9824 48.5750 18.7140 29.9452 12.7233 19.3031 8.0737 18.5503 85.2219 5.7764 8.9821 23.9978 35.9087 35.5425 5.6363 42.9455 21.5041 62.6719 18.3134 30.4458 178.5516 144.9188 38.0809 0.5485 31.0721 62.9699 255.1791 44.8104 111.0579 171.5198 5.1175 148.7694 148.5363 18.8479 5.1185 0.6508 13.2236 44.9456 93.2421 185.6385 86.4366 13.5547 153.0845 64.9328 333.2687 294.5834 58.0523 148.8689 14.8446 9.5690 8.8736 2.6065 1.0687 0.8006 1.4071 63.4005 8.7338 21.8465 8.2773
temp: 298.150 k
press: 1.00000 atm
elementType: 53 53 53 53 16 8 8 8 8 8 8 8 7 6 6 6 6 6 6 6 6 6 6 6 6 6 6 6 1 1 1 1 1 1 1 1 1 1 1
symmnumber: 1
zpe: 620107.1 jmol-1
zpe.correction: 0.236186 hartree
zpe.thermalcorrener: 0.268187 hartree
zpe.thermalcorrenthalpy: 0.269132 hartree
zpe.thermalcorrgfe: 0.160016 hartree
zpe.sumelectzpe: -1601.352316 hartree
zpe.sumelectthermal: -1601.320314 hartree
zpe.sumelectthermalent: -1601.319370 hartree
zpe.sumelectthermalfe: -1601.428485 hartree
dipole: -10.1673 -2.3295 -1.1146
dipole: 10.4902
quadrupole: -229.4164 -227.5721 -225.8713
quadrupole: -47.1132 -1.7337 -6.6034
quadrupole: -1.7965 0.0478 1.7486 -47.1132 -1.7337 -6.6034
hfenergy: -1601.5885019 hartree
pointgroup: C01 [X(C15H11I4N1O7S1)]
dipole: -3.9907318 0.7740014 0.7130142 debye
polarizability: 523.2325486|-20.7641908|325.2979175|-28.2337261|47.2600769|299.5597983 unknown
InChI: InChI=1S/C15H10I4NO4.HO3S/c16-8-4-7(5-9(17)13(8)21)24-14-10(18)1-6(2-11(14)19)3-12(20)15(22)23;1-4(2)3/h1-2,4-5,12,22H,3,20H2;1H
charge 0 multiplicity 1
39 atoms
I  -1.489093 1.947335 3.039103
I  -0.013398 1.552523 -2.935069
I  2.133377 -3.098231 0.556867
I  5.562418 1.962965 1.27999
S  5.675192 -1.763191 -0.830698
O  0.231163 2.104207 0.291023
O  -4.543957 -2.988435 0.544669
O  4.647967 -1.174239 1.160222
O  -5.531038 -1.157082 1.585333
O  7.315511 -1.055427 -0.337473
O  6.042824 -3.25543 -1.325172
O  4.91422 -0.754386 -1.859462
N  -6.643456 -1.565015 -1.405969
C  -5.134417 0.347573 -0.94934
C  -3.7220 0.80381 -0.618057
C  -5.309639 -1.193671 -0.89958
C  -2.755335 0.929263 -1.647894
C  -3.347986 1.095185 0.718717
C  -1.063957 1.603443 -0.012075
C  -2.029083 1.492904 1.017809
C  -1.435731 1.329115 -1.351404
C  -5.132607 -1.718734 0.537869
C  1.295651 1.220596 0.484634
C  2.549676 1.84474 0.724053
C  1.150228 -0.190683 0.449199
C  3.599045 -0.413274 0.916555
C  2.281236 -0.983886 0.657711
C  3.672665 1.043626 0.917861
H  -5.416012 0.657113 -1.970671
H  -5.855679 0.801209 -0.244141
H  -4.553384 -1.679121 -1.539293
H  -3.038797 0.726641 -2.685455
H  -4.089746 1.003144 1.517127
H  -7.425828 -1.188749 -0.860921
H  -6.756202 -2.554595 -1.642362
H  2.595609 2.935783 0.738639
H  0.173759 -0.638928 0.252992
H  -4.51025 -3.341486 1.476047
H  7.095253 -0.288306 0.274416
