program: Gaussian 09
title: 000131739
version: EM64L-G09RevD.01
frameworkgroup: C1[X(C10H17NO2)]
method: RPBEPBE
basis: SDD
operation: Freq
keyword: #p
keyword: freq=noraman
keyword: PBEPBE/SDD
title: #p freq=noraman PBEPBE/SDD
converged: YES YES NO NO
title: Mulliken charges:
elementType: O O N C C C C C C C C C C H H H H H H H H H H H H H H H H H
charge: -0.282977 -0.258765 -0.079901 -0.396525 -0.472323 -0.380713 0.249120 -0.326118 -0.617653 0.126518 -0.220166 -0.383458 -0.679256 0.218902 0.189556 0.237172 0.228195 0.193445 0.238427 0.256221 0.222900 0.188111 0.228890 0.220244 0.221424 0.213110 0.215294 0.212506 0.224644 0.213178
chargesum: 0.00000
title: Mulliken charges with hydrogens summed into heavy atoms:
elementType: O O N C C C C C C C C C C
charge: -0.282977 -0.258765 -0.079901 0.011932 -0.006956 0.051159 0.249120 -0.069897 0.022248 0.126518 0.221501 0.044946 -0.028928
polarizability: 1.75579783e+02 -7.18682187e+00 1.16771172e+02 -1.00605261e-01 8.09950995e-02 8.34225124e+01
1716.lowfreq: -17.1844 -4.8972 0.0004 0.0006 0.0009 4.0395 31.8894 49.7960 68.6274
frequency: 31.3349 49.7134 68.6163 70.5537 82.2407 159.9070 181.9603 194.3177 217.1841 226.9382 250.0660 253.9664 302.9098 314.7580 342.4892 377.5821 416.7355 505.0908 520.4225 564.8149 683.9052 723.7396 755.7329 767.3766 799.5688 857.5190 878.0116 883.9431 930.2188 942.3403 963.8365 990.5797 1014.2207 1046.4604 1052.6777 1071.1680 1087.6705 1112.9367 1135.3674 1143.7703 1147.0475 1180.4609 1192.0572 1226.2334 1227.9437 1250.1026 1278.0261 1285.8450 1304.7340 1307.5266 1339.4944 1365.0103 1372.3482 1378.9534 1394.8401 1432.1154 1447.4881 1449.2849 1464.3589 1470.5270 1476.5068 1477.5830 1479.6553 1481.0091 1490.0301 1603.0206 1667.4524 2783.3376 2838.5434 2855.5631 2977.6121 2980.1575 2995.8888 2997.9292 3003.3388 3017.7107 3035.4604 3041.8943 3058.0676 3063.8405 3076.8250 3083.7891 3084.5424 3134.0108
redmass: 2.8772 1.8001 4.2169 4.1579 3.0756 3.0898 3.6863 1.8558 1.1161 1.4143 2.4955 2.8824 2.3067 4.1321 3.0481 3.2767 2.3936 4.4615 3.9119 5.4154 3.5548 4.7585 1.0799 4.2034 2.7030 1.4013 1.1574 2.5215 2.3924 2.5560 2.2254 1.9009 4.2660 2.0778 2.6989 2.1045 1.6149 1.3393 2.2212 1.4827 2.2051 1.1602 1.6449 3.4800 1.2622 1.7836 1.0991 1.6289 1.3423 1.3407 1.4835 1.9611 1.4748 1.7498 1.2224 1.1635 1.0980 1.0845 1.0548 1.0734 1.0922 1.0569 1.0426 1.0597 1.0871 11.8255 7.2931 1.0715 1.0685 1.0598 1.0826 1.0359 1.0593 1.0629 1.0582 1.0723 1.0876 1.1018 1.0988 1.1045 1.1007 1.0991 1.1043 1.0913
irintensity: 0.4593 0.5095 0.6643 1.7145 0.2815 1.4350 1.5544 4.9908 0.0118 1.4958 0.5727 0.4155 9.6656 13.6127 5.6862 1.4201 0.1281 1.2623 1.5753 0.6975 21.8537 2.6038 6.2991 7.9420 5.3205 8.8244 2.3180 12.6478 2.2398 30.7577 12.4705 19.1651 237.1535 27.3360 0.7149 74.9461 4.7803 13.1187 3.1204 0.5007 5.1642 3.2337 176.0973 213.2620 2.6727 36.7255 0.0878 25.1578 1.6533 6.0217 0.1902 10.8817 1.5281 2.9776 12.9130 0.5065 19.3724 18.4379 15.5187 1.9132 12.6682 1.9285 12.3559 10.6088 17.5684 187.0519 61.4259 77.0205 58.9226 219.0341 27.4396 34.5051 5.2145 13.3280 43.5153 50.1740 40.5929 0.5376 20.0507 0.3755 30.8851 42.3093 95.7625 2.3448
temp: 298.150 k
press: 1.00000 atm
elementType: 8 8 7 6 6 6 6 6 6 6 6 6 6 1 1 1 1 1 1 1 1 1 1 1 1 1 1 1 1 1
symmnumber: 1
zpe: 671050.1 jmol-1
zpe.correction: 0.255589 hartree
zpe.thermalcorrener: 0.270023 hartree
zpe.thermalcorrenthalpy: 0.270967 hartree
zpe.thermalcorrgfe: 0.213217 hartree
zpe.sumelectzpe: -595.407664 hartree
zpe.sumelectthermal: -595.393231 hartree
zpe.sumelectthermalent: -595.392286 hartree
zpe.sumelectthermalfe: -595.450036 hartree
dipole: -0.7823 -1.9834 0.7001
dipole: 2.2441
quadrupole: -62.5825 -82.8941 -80.2592
quadrupole: -4.3557 -2.1409 -0.9473
quadrupole: 12.6628 -7.6488 -5.0139 -4.3557 -2.1409 -0.9473
hfenergy: -595.6632535 hartree
pointgroup: C01 [X(C10H17N1O2)]
dipole: 0.3129281 -0.7379913 -0.3700624 debye
polarizability: 175.4691313|7.6009757|116.3951976|0.6385077|4.0031224|83.9091385 unknown
InChI: InChI=1S/C10H17NO2/c1-3-8-13-10(12)9-4-6-11(2)7-5-9/h4H,3,5-8H2,1-2H3
charge 0 multiplicity 1
30 atoms
O  -1.726466 -0.183444 0.040364
O  -1.18277 2.075074 0.244177
N  3.287245 -0.513533 0.308673
C  2.352924 -1.303527 -0.526172
C  0.898385 -1.093859 -0.059474
C  3.055296 0.939758 0.191247
C  0.593872 0.386142 0.091319
C  1.595474 1.307366 0.189325
C  4.702149 -0.867213 0.105465
C  -0.811992 0.877204 0.134008
C  -3.166815 0.199509 0.086876
C  -3.981403 -1.091278 -0.007293
C  -5.498533 -0.801505 0.037641
H  2.626374 -2.370625 -0.433729
H  2.437629 -1.031315 -1.61105
H  0.740656 -1.60588 0.908768
H  0.19662 -1.554775 -0.777688
H  3.518287 1.36797 -0.74255
H  3.561118 1.451727 1.035934
H  1.336749 2.370814 0.271607
H  5.333515 -0.300195 0.813897
H  5.071102 -0.652448 -0.930379
H  4.850151 -1.943139 0.305804
H  -3.376115 0.888683 -0.752691
H  -3.355616 0.745434 1.030321
H  -3.722005 -1.616536 -0.945731
H  -3.696153 -1.760698 0.825716
H  -5.808441 -0.148545 -0.799611
H  -6.078487 -1.738514 -0.0339
H  -5.784549 -0.299354 0.980729
