program: Gaussian 09
title: 000131737
version: EM64L-G09RevD.01
frameworkgroup: C1[X(C14H8N4OS)]
method: RPBEPBE
basis: SDD
operation: Freq
keyword: #p
keyword: freq=noraman
keyword: PBEPBE/SDD
title: #p freq=noraman PBEPBE/SDD
converged: NO NO NO NO
title: Mulliken charges:
elementType: S O N N N N C C C C C C C C C C C C C C H H H H H H H H
charge: 0.391649 -0.207627 0.107245 -0.453854 0.001096 -0.065515 0.501432 0.376217 -0.626220 -0.486381 -0.045016 -0.277265 -0.280258 0.331846 0.135094 -0.380047 -0.379915 -0.218021 -0.217958 -0.232969 0.240006 0.261046 0.341584 0.242694 0.242736 0.232268 0.232270 0.233863
chargesum: 0.00000
title: Mulliken charges with hydrogens summed into heavy atoms:
elementType: S O N N N N C C C C C C C C C C C C C C
charge: 0.391649 -0.207627 0.107245 -0.112270 0.001096 -0.065515 0.501432 0.376217 -0.626220 -0.486381 -0.045016 -0.037259 -0.019212 0.331846 0.135094 -0.137353 -0.137179 0.014246 0.014312 0.000894
polarizability: 3.42990767e+02 9.77061109e+00 1.71829498e+02 -5.31351461e-03 7.16269376e-02 1.15920932e+02
1716.lowfreq: -61.6098 -7.9567 -3.4259 -0.0025 -0.0016 -0.0006 7.3577 32.8973 58.2979
frequency: -61.6086 32.7417 58.2959 75.6740 101.3174 153.3518 158.3717 212.4612 231.4224 254.3615 270.8734 346.2135 363.7568 393.9250 422.5618 432.9298 435.8779 476.8512 499.7249 522.8311 557.4497 562.6947 588.3083 613.7865 630.3715 631.2461 670.6885 671.6317 703.6258 732.0115 739.5921 768.8818 788.3319 788.8789 839.4898 840.2424 852.1565 875.9152 922.9983 970.7200 975.1565 977.6011 988.1847 997.8858 1017.3197 1054.4714 1058.3994 1079.9255 1094.0143 1135.6394 1174.5145 1188.9895 1214.7716 1254.2176 1292.1407 1312.3137 1315.7975 1343.5055 1371.1446 1383.9293 1420.8015 1428.1722 1473.1472 1482.9338 1507.6051 1558.2801 1582.2936 1586.2106 1613.6833 1623.2549 3128.1311 3133.4478 3135.1789 3144.4801 3154.2877 3168.8045 3176.2040 3574.6648
redmass: 4.0924 7.4469 6.3529 10.3120 7.3699 5.5450 7.6126 7.7180 8.2365 8.1692 6.5347 6.9044 7.0400 2.8123 11.4668 3.7691 11.5226 7.4316 11.3415 10.0654 9.3072 4.0699 10.0058 6.6882 1.1975 8.2379 4.4630 7.4638 1.6744 8.1756 9.6359 2.4060 6.5578 5.0146 1.5208 9.4207 1.2454 9.7635 1.4249 1.3725 1.3878 9.5116 6.0819 1.3292 3.5771 2.9596 4.3043 1.6082 3.6598 1.6083 1.0527 1.1166 3.5640 3.4730 2.8001 1.3608 5.4601 4.3944 7.1344 2.8272 3.5283 2.1872 3.0518 2.7917 6.5096 6.0850 7.1687 6.0133 6.2193 12.1904 1.0848 1.0880 1.0907 1.0927 1.0970 1.1019 1.0961 1.0802
irintensity: 0.5798 0.5681 0.9487 0.1557 5.8648 0.0116 3.4556 0.1595 4.6242 0.3822 0.7431 0.8570 0.0594 0.0516 9.2194 0.2157 5.2599 7.6187 0.1325 1.1393 2.9459 14.8505 0.8428 0.0030 106.4223 26.7337 5.2455 9.4432 57.9063 6.4202 8.0068 68.8757 0.1856 12.6688 39.0535 12.7854 0.6547 35.5359 1.9333 0.0573 0.0513 3.4679 4.2379 0.1060 12.5315 5.2730 10.2939 7.7451 40.8513 0.4041 0.0189 4.0225 6.4059 139.7341 4.4910 0.7093 3.1257 41.2921 0.0004 94.6709 8.9187 9.1928 62.9169 14.3706 63.1351 13.4186 165.9432 1.2848 0.0089 388.1492 1.6122 0.0105 7.8949 14.3665 32.4092 25.3460 5.1160 68.8297
temp: 298.150 k
press: 1.00000 atm
elementType: 16 8 7 7 7 7 6 6 6 6 6 6 6 6 6 6 6 6 6 6 1 1 1 1 1 1 1 1
symmnumber: 1
zpe: 504310.1 jmol-1
zpe.correction: 0.192082 hartree
zpe.thermalcorrener: 0.206548 hartree
zpe.thermalcorrenthalpy: 0.207492 hartree
zpe.thermalcorrgfe: 0.149618 hartree
zpe.sumelectzpe: -1229.178368 hartree
zpe.sumelectthermal: -1229.163902 hartree
zpe.sumelectthermalent: -1229.162957 hartree
zpe.sumelectthermalfe: -1229.220831 hartree
dipole: 7.8649 6.3197 -0.0200
dipole: 10.0894
quadrupole: -152.9905 -119.8979 -115.4920
quadrupole: -12.7269 0.0816 0.0542
quadrupole: -23.5304 9.5623 13.9681 -12.7269 0.0816 0.0542
hfenergy: -1229.3704493 hartree
pointgroup: C01 [X(C14H8N4O1S1)]
dipole: 3.0633603 2.5243934 -0.000745 debye
polarizability: 342.7232933|11.8816337|172.0961394|0.0349666|0.2279272|115.9217648 unknown
InChI: InChI=1S/C14H8N4OS/c19-13-12-11(16-18-17-13)9-6-7-10(15-14(9)20-12)8-4-2-1-3-5-8/h1-7,16H
charge 0 multiplicity 1
28 atoms
S  -1.673286 -1.942253 -0.003556
O  -4.929144 -2.148871 -0.000838
N  0.872677 -0.819141 -0.001847
N  -3.437687 1.638828 0.001654
N  -4.841549 1.42243 0.00247
N  -5.289052 0.193871 0.000754
C  -1.063604 0.716195 -0.000071
C  -2.506763 0.613973 -0.000273
C  -0.451192 -0.581135 -0.001734
C  -2.987678 -0.703306 -0.002959
C  1.702681 0.269499 -0.000127
C  -0.194296 1.835935 0.001708
C  1.192879 1.604543 0.001696
C  3.181788 0.020915 -0.000203
C  -4.407191 -1.004566 -0.005124
C  3.888164 -0.087711 1.223837
C  3.88693 -0.094461 -1.224334
C  5.28369 -0.310072 1.222516
C  5.28247 -0.316714 -1.223181
C  5.984042 -0.423711 -0.00038
H  -0.581626 2.861043 0.003071
H  1.900412 2.437719 0.002962
H  -3.194281 2.629731 0.00346
H  3.345808 -0.009524 2.172682
H  3.343601 -0.021526 -2.173033
H  5.820796 -0.397589 2.173246
H  5.818639 -0.409335 -2.173955
H  7.065673 -0.597471 -0.000443
