program: Gaussian 09
title: 000131736
version: EM64L-G09RevD.01
frameworkgroup: C1[X(C18H11Cl2N3)]
method: RPBEPBE
basis: SDD
operation: Freq
keyword: #p
keyword: freq=noraman
keyword: PBEPBE/SDD
title: #p freq=noraman PBEPBE/SDD
converged: YES YES NO NO
title: Mulliken charges:
elementType: Cl Cl N N N C C C C C C C C C C C C C C C C C C H H H H H H H H H H H
charge: -0.042337 -0.040934 0.002844 -0.051753 0.015766 0.211106 0.308984 -0.097171 0.002221 0.311401 -0.664896 0.468883 -0.322804 -0.363477 -0.121429 -0.241250 -0.408057 -0.334501 -0.369885 -0.226566 -0.237232 -0.389622 -0.224896 0.231477 0.242041 0.284054 0.282640 0.263531 0.257014 0.264720 0.259400 0.236608 0.255842 0.238277
chargesum: 0.00000
title: Mulliken charges with hydrogens summed into heavy atoms:
elementType: Cl Cl N N N C C C C C C C C C C C C C C C C C C
charge: -0.042337 -0.040934 0.002844 -0.051753 0.015766 0.211106 0.308984 -0.097171 0.002221 0.311401 -0.191377 0.468883 -0.038750 -0.080837 -0.121429 0.022281 -0.151043 -0.334501 -0.105165 0.032835 -0.000624 -0.133779 0.013381
chargesum: -0.00011
polarizability: 3.04430107e+02 -1.46859514e+01 2.36790857e+02 2.00023957e+01 2.93880794e+01 1.69765420e+02
1716.lowfreq: -11.7578 -4.6205 -1.0291 -0.0218 -0.0006 4.7601 28.9466 38.5520 52.1791
frequency: 28.8725 38.5128 52.1388 61.2526 94.1978 110.9256 129.8779 164.2601 189.5965 208.0849 220.7950 233.5620 258.2940 289.9882 321.8224 343.9508 352.0035 383.9757 408.4557 420.1877 439.9031 450.7208 473.0412 481.4949 514.8657 521.1438 573.9772 582.9260 632.0054 639.1363 656.0649 673.3943 690.6139 704.7529 735.8139 755.0815 770.7652 781.4577 801.4236 822.9934 843.7186 871.9660 895.6627 906.7868 931.8802 953.1068 959.8577 970.6597 974.2432 988.3596 990.7347 1017.8016 1022.9855 1043.5985 1083.2147 1091.5397 1116.8208 1123.9708 1159.4621 1168.1811 1173.1552 1202.6062 1234.3334 1249.4411 1258.5890 1276.3440 1293.9558 1299.7873 1333.4223 1366.0614 1371.6080 1376.4345 1386.3462 1411.6674 1420.5218 1457.6061 1468.8765 1471.3781 1512.9732 1533.3491 1551.2478 1566.2775 1577.2647 1593.5912 1601.2686 2943.4894 3063.6409 3130.9988 3140.0155 3154.1222 3160.2906 3163.3929 3164.6325 3167.4776 3177.8558 3179.3428
redmass: 10.0185 6.9632 12.3000 6.0489 5.5258 6.5125 5.3602 6.8430 7.1370 6.2097 6.1636 7.2948 9.2121 5.0329 3.6732 6.3613 5.6444 5.3654 7.0326 5.9534 3.4055 4.1444 5.2246 5.1934 4.2280 6.3292 4.5627 3.4216 6.4277 7.5907 6.5996 5.5102 6.2471 6.8983 3.3113 2.7626 1.7949 5.2632 4.1030 4.5308 1.7605 1.3976 1.5361 1.6529 3.4587 1.5609 1.5186 1.5139 3.3043 1.9816 1.4000 6.9019 5.8155 2.2115 4.6783 2.1111 2.4539 1.6607 1.7632 2.6196 1.0574 1.6011 3.3018 1.6101 1.4948 2.0386 2.5977 2.5755 1.4308 8.2066 2.8074 4.5140 2.8922 1.7719 2.2415 2.5578 1.1677 2.5779 7.7474 6.0481 7.7925 6.4886 8.7466 6.8898 7.0566 1.0678 1.0936 1.0926 1.0860 1.0906 1.0886 1.0927 1.0922 1.0952 1.1001 1.0975
irintensity: 0.3150 0.1947 0.0329 1.1083 1.2786 0.4052 0.1646 0.4471 0.1589 0.3541 2.2304 2.4019 0.9907 1.8164 0.1128 1.6040 1.5184 1.4683 4.7784 5.2351 9.2388 13.4634 0.8512 3.3213 13.7990 11.1960 4.5605 3.2066 2.9996 3.7791 7.2488 2.7395 6.4104 8.5324 14.4126 27.9313 28.2071 54.0396 18.8613 35.8667 14.2701 0.1594 10.4592 13.9134 23.8478 0.2398 1.4655 3.6656 13.5197 3.4190 2.4171 14.5160 25.3047 5.2730 5.5518 30.0559 1.8598 0.7903 2.8824 37.7786 0.8203 12.7819 0.7971 6.9038 1.0721 20.9774 55.0260 0.6471 2.7948 1.9619 19.8982 36.3017 33.7327 58.8903 35.4572 16.0243 6.9372 28.4558 58.4504 86.9357 50.9275 2.6734 31.7657 51.8568 12.5985 34.6391 27.0527 14.9060 1.7853 9.5457 0.2009 19.3882 0.4409 7.6522 14.7798 2.6764
temp: 298.150 k
press: 1.00000 atm
elementType: 17 17 7 7 7 6 6 6 6 6 6 6 6 6 6 6 6 6 6 6 6 6 6 1 1 1 1 1 1 1 1 1 1 1
symmnumber: 1
zpe: 637371.8 jmol-1
zpe.correction: 0.242762 hartree
zpe.thermalcorrener: 0.260883 hartree
zpe.thermalcorrenthalpy: 0.261827 hartree
zpe.thermalcorrgfe: 0.195306 hartree
zpe.sumelectzpe: -1775.313909 hartree
zpe.sumelectthermal: -1775.295788 hartree
zpe.sumelectthermalent: -1775.294844 hartree
zpe.sumelectthermalfe: -1775.361364 hartree
dipole: -2.0607 -0.0673 -2.3237
dipole: 3.1066
quadrupole: -141.4488 -146.4997 -142.0108
quadrupole: 15.4317 -5.2236 4.9428
quadrupole: 1.8710 -3.1800 1.3090 15.4317 -5.2236 4.9428
hfenergy: -1775.5566708 hartree
pointgroup: C01 [X(C18H11Cl2N3)]
dipole: 0.857872 -0.2872637 -0.8218055 debye
polarizability: 300.3769046|-26.2120976|228.6409085|-11.3378914|-40.4969623|181.968571 unknown
InChI: InChI=1S/C18H11Cl2N3/c19-12-5-6-13-15(7-12)18(14-3-1-2-4-16(14)20)22-9-11-8-21-10-23-17(11)13/h1-8,10H,9H2
charge 0 multiplicity 1
34 atoms
Cl 1.661425 -4.58984 0.61697
Cl 1.287456 0.464325 2.43425
N  0.069585 1.214799 -1.594927
N  -3.341678 0.036917 0.970259
N  -4.306203 2.010132 -0.089384
C  0.056068 -0.890351 -0.217637
C  -1.31928 -1.063212 0.153328
C  0.630443 0.404965 -0.723757
C  -2.3374 0.009548 0.028167
C  -2.321203 0.94988 -1.043814
C  -1.272852 0.849986 -2.128123
C  2.014557 0.79343 -0.280074
C  0.955354 -1.980632 -0.058022
C  -1.730066 -2.298054 0.724023
C  0.495687 -3.200687 0.456362
C  -0.841288 -3.377274 0.868934
C  -3.321784 1.949033 -1.035592
C  2.446717 0.830158 1.069304
C  2.954135 1.186781 -1.272948
C  3.753867 1.211318 1.429866
C  4.267749 1.568241 -0.93526
C  -4.269642 1.02464 0.858822
C  4.672402 1.57338 0.419694
H  -1.266722 -0.18608 -2.532911
H  -1.505822 1.544684 -2.952301
H  2.008744 -1.859348 -0.325513
H  -2.7682 -2.388527 1.056296
H  -1.173268 -4.328834 1.292982
H  -3.346274 2.721207 -1.813434
H  2.617279 1.192346 -2.31415
H  4.040999 1.236432 2.484874
H  4.970844 1.860648 -1.721794
H  -5.067886 1.037021 1.607064
H  5.690558 1.866765 0.696149
