program: Gaussian 09
title: 000131734
version: EM64L-G09RevD.01
frameworkgroup: C1[X(C10H18O2)]
method: RPBEPBE
basis: SDD
operation: Freq
keyword: #pfreq=noraman
keyword: PBEPBE/SDD
title: #p freq=noraman PBEPBE/SDD
converged: YES YES NO NO
title: Mulliken charges:
elementType: O O C C C C C C C C C C H H H H H H H H H H H H H H H H H H
charge: -0.312103 -0.472189 -0.139598 0.332076 -0.386161 -0.431998 -0.736957 -0.480237 -0.315046 0.373375 -0.785107 -0.794006 0.241788 0.223298 0.246546 0.230433 0.189884 0.230741 0.238639 0.205249 0.213288 0.237697 0.350863 0.212211 0.215354 0.226501 0.215293 0.219722 0.232943 0.217500
chargesum: 0.00000
title: Mulliken charges with hydrogens summed into heavy atoms:
elementType: O O C C C C C C C C C C
charge: -0.312103 -0.121326 0.102190 0.332076 0.083684 -0.011682 -0.062329 -0.029251 -0.102835 0.373375 -0.127958 -0.123841
polarizability: 1.50259783e+02 -3.71639162e+00 9.60522347e+01 -5.47753147e+00 -1.35277933e+00 1.01015461e+02
1716.lowfreq: -17.0659 -10.9651 -9.3911 -0.0006 -0.0005 -0.0002 12.8593 33.7009 71.1289
frequency: 8.2557 32.5201 71.1153 83.4230 104.3458 118.5098 166.2510 183.1426 189.3439 229.1278 253.9619 278.3405 291.9225 349.4851 361.7916 388.2031 391.5198 453.0467 508.1811 528.2276 554.4065 582.2220 698.3027 739.8894 760.9646 791.8862 824.9907 845.4926 876.2625 922.5193 948.1510 970.7997 990.2296 993.5089 1008.8795 1029.2268 1032.1292 1076.5114 1081.9160 1099.0462 1104.2046 1122.1282 1136.5429 1177.4432 1204.5841 1229.7467 1240.6219 1255.7795 1296.0579 1315.0942 1339.8693 1356.6293 1383.5201 1388.0967 1388.5199 1399.4477 1448.5827 1455.2096 1458.5376 1461.0786 1466.4277 1472.4705 1472.8564 1475.5531 1484.9861 1695.9811 2956.2548 2963.6366 2969.8633 2979.2276 2991.5700 3027.5355 3031.1368 3033.6396 3052.1556 3067.5985 3076.0845 3077.4499 3090.0564 3095.7867 3099.3126 3100.7686 3188.0110 3458.0247
redmass: 3.0102 3.2103 3.4085 2.9818 2.7619 1.1154 2.0188 1.1875 1.2806 2.6096 3.7681 2.8657 2.5272 2.7831 3.2428 2.8119 2.3495 2.3470 2.5821 1.6116 2.0043 2.6734 2.6058 5.0705 1.8296 2.2892 3.2696 1.6076 2.2699 1.8504 1.3942 1.6723 1.5227 1.2504 1.4343 1.7811 1.8465 2.0485 1.6648 1.4273 1.3942 1.3449 2.0399 2.6811 2.2521 1.8485 1.5230 1.3505 1.1882 1.5057 1.6347 1.4388 1.5771 1.4565 1.3031 1.2383 1.0764 1.0507 1.1270 1.0754 1.1476 1.0522 1.0716 1.0508 1.0883 6.4735 1.0371 1.0389 1.0618 1.0637 1.0356 1.0969 1.0964 1.0936 1.0959 1.0953 1.0524 1.0969 1.0988 1.0957 1.0959 1.0953 1.1192 1.0644
irintensity: 0.8091 0.2661 1.1937 0.8489 3.5273 0.3268 5.7219 1.6846 1.8693 4.1268 4.3991 0.3251 1.4126 6.7965 31.2542 4.8931 3.9060 2.8878 40.9580 51.4180 101.3877 8.7369 5.4123 7.0348 2.8997 4.6581 50.9656 10.4303 8.3424 8.0175 1.2781 2.8100 8.7376 5.7269 10.4039 6.7259 2.9928 19.9844 3.3925 11.3147 13.6802 15.3979 16.9287 32.0253 5.6239 10.9317 1.1112 19.0865 0.4340 36.8811 8.3108 3.4879 21.0510 20.4556 22.2119 12.7653 2.5259 2.0105 0.2511 3.9146 7.1368 19.4536 14.4368 10.0845 12.7160 3.0523 42.9498 55.8624 15.2867 26.6877 23.8060 9.4664 45.0851 7.7653 13.9304 24.7583 24.0306 54.5057 19.3728 36.1965 31.6448 25.1801 15.2188 19.4455
temp: 298.150 k
press: 1.00000 atm
elementType: 8 8 6 6 6 6 6 6 6 6 6 6 1 1 1 1 1 1 1 1 1 1 1 1 1 1 1 1 1 1
symmnumber: 1
zpe: 677721.2 jmol-1
zpe.correction: 0.258130 hartree
zpe.thermalcorrener: 0.273032 hartree
zpe.thermalcorrenthalpy: 0.273977 hartree
zpe.thermalcorrgfe: 0.214371 hartree
zpe.sumelectzpe: -541.269180 hartree
zpe.sumelectthermal: -541.254278 hartree
zpe.sumelectthermalent: -541.253334 hartree
zpe.sumelectthermalfe: -541.312939 hartree
dipole: 0.6495 0.6396 -1.8455
dipole: 2.0583
quadrupole: -64.1372 -79.9953 -73.7082
quadrupole: -0.7815 -5.4353 -2.0616
quadrupole: 8.4764 -7.3818 -1.0946 -0.7815 -5.4353 -2.0616
hfenergy: -541.5273103 hartree
pointgroup: C01 [X(C10H18O2)]
dipole: -0.2376405 -0.0521234 -0.7723993 debye
polarizability: 150.1776893|-4.2585932|95.5765381|5.3754831|-0.1519144|101.573251 unknown
InChI: InChI=1S/C10H18O2/c1-8(2)5-4-6-10(3,11)9-7-12-9/h5,9,11H,4,6-7H2,1-3H3
charge 0 multiplicity 1
30 atoms
O  -2.290734 1.613308 0.540268
O  -1.740009 -0.988589 1.232605
C  -2.361311 0.559911 -0.55538
C  -1.643989 -0.758947 -0.223093
C  -3.610558 0.963493 0.156898
C  -0.155008 -0.700197 -0.669478
C  -2.368488 -1.942367 -0.888349
C  0.697603 0.381888 0.048357
C  2.102188 0.454273 -0.516497
C  3.277306 0.135456 0.100139
C  4.603101 0.269918 -0.634266
C  3.39593 -0.365125 1.529345
H  -2.171411 0.965133 -1.558714
H  -4.320035 1.640632 -0.331638
H  -4.016063 0.294122 0.924611
H  0.296855 -1.691811 -0.479168
H  -0.116521 -0.533626 -1.766423
H  -3.419685 -1.991305 -0.556781
H  -1.872534 -2.884677 -0.59901
H  -2.343253 -1.857645 -1.990021
H  0.716263 0.162852 1.13073
H  0.208002 1.369985 -0.065449
H  -1.611778 -0.099664 1.667257
H  2.158929 0.800263 -1.561908
H  5.284652 0.962971 -0.101295
H  4.466611 0.647749 -1.662658
H  5.127138 -0.705242 -0.692306
H  3.990198 0.341578 2.142668
H  2.420422 -0.504487 2.021956
H  3.932277 -1.33455 1.557199
