program: Gaussian 09
title: 000131733
version: EM64L-G09RevD.01
frameworkgroup: C1[X(C17H23I3N2O4)]
method: RPBEPBE
basis: SDD
operation: Freq
keyword: #p
keyword: freq=noraman
keyword: PBEPBE/SDD
title: #p freq=noraman PBEPBE/SDD
converged: YES YES NO NO
title: Mulliken charges:
elementType: I I I O O O O N N C C C C C C C C C C C C C C C C C H H H H H H H H H H H H H H H H H H H H H H H
charge: 0.099809 0.131534 0.139514 -0.413739 -0.223517 -0.198690 -0.462204 -0.091804 -0.506530 -0.065752 -0.720849 -0.387042 0.799606 -0.491608 -0.718278 -0.352857 0.754336 0.154819 -0.330883 -0.712587 -0.619868 0.215810 -0.522209 -0.094064 -0.331669 -0.672630 0.258088 0.267086 0.269255 0.230036 0.211260 0.200649 0.252362 0.228452 0.221293 0.184438 0.217985 0.220788 0.212168 0.240719 0.317629 0.276293 0.251967 0.183367 0.236901 0.203335 0.212923 0.378627 0.345731
chargesum: 0.00000
title: Mulliken charges with hydrogens summed into heavy atoms:
elementType: I I I O O O O N N C C C C C C C C C C C C C C C C C
charge: 0.099809 0.131534 0.139514 -0.035112 -0.223517 -0.198690 -0.116473 -0.091804 -0.188901 0.192336 -0.184508 0.054253 0.799606 -0.038597 -0.718278 0.096888 0.754336 0.154819 0.071540 -0.038912 -0.619868 0.215810 -0.522209 0.182230 0.103666 -0.019471
polarizability: 3.78783485e+02 -6.93936307e+00 3.16567973e+02 -3.59162288e+01 1.55327347e+00 1.96311034e+02
1716.lowfreq: -6.5440 -5.1946 -1.7270 -0.0004 -0.0004 0.0005 12.3853 15.2133 18.4375
frequency: 12.1813 14.9021 18.3632 21.3281 23.9747 34.8161 36.5546 40.2839 48.3115 56.4206 69.9261 75.2016 86.8780 87.4528 97.7148 101.2174 110.0630 124.9844 141.6328 155.7297 159.8551 164.3437 173.1157 209.3138 211.6344 232.5232 247.1714 251.1213 264.3154 270.4640 276.6162 310.2959 329.0349 339.6829 363.2503 382.6077 394.9395 409.7101 429.0704 453.1390 489.5725 501.3715 510.5184 537.4787 568.4542 575.7333 600.1439 623.3948 632.0610 641.8197 700.2020 718.1354 733.4862 758.9674 774.0279 792.7626 799.4854 813.7611 825.7487 880.7918 905.0020 922.0257 948.3607 949.1805 965.7795 972.8450 993.1541 1006.2526 1014.0774 1016.8920 1038.6704 1061.9627 1074.7920 1084.6896 1102.0737 1103.4799 1128.2668 1140.0229 1150.9786 1161.1316 1187.0915 1217.3851 1221.1853 1238.4615 1243.4468 1252.4635 1260.1067 1273.9228 1274.4839 1292.2368 1309.4108 1312.4602 1317.0194 1336.0276 1337.5449 1343.3209 1363.7938 1370.9076 1376.0418 1388.7962 1394.8072 1406.0028 1412.4342 1439.5830 1445.1398 1457.0875 1468.8281 1471.7561 1472.2344 1478.2445 1478.7489 1485.1639 1488.7712 1492.2294 1521.0296 1545.1934 1648.9845 1659.0327 2769.5999 2848.7385 2944.1476 2953.6916 2980.1552 2983.0243 2984.7697 3003.8299 3013.7967 3023.0837 3027.0931 3032.0129 3043.8179 3053.3325 3069.2620 3072.7041 3076.0844 3085.8311 3094.4839 3184.5846 3498.2875 3503.9419 3584.3298
redmass: 6.4055 8.0313 10.9461 4.1170 5.2952 6.2038 7.4872 6.9540 5.6212 3.4071 5.6681 3.4271 8.6163 6.0761 3.3127 7.2043 2.5241 3.0903 3.8697 3.9683 29.8139 3.9137 4.5662 1.7759 3.4954 1.1219 1.9561 2.4986 3.7384 3.3416 2.4252 4.5192 3.1062 6.6773 3.8584 3.5728 2.9176 4.2831 3.4084 3.7482 1.8840 1.7607 4.2902 3.5811 4.0318 3.5270 1.6508 3.5888 7.3682 6.7990 5.0198 4.2216 2.4208 3.6986 4.5656 1.4919 1.1798 1.6784 1.9861 1.4141 1.7519 5.1551 2.4799 2.4826 6.6272 2.6019 3.7221 3.2807 6.0240 2.2865 2.3260 2.0821 1.6706 2.4231 1.9164 1.8869 2.2024 2.3505 1.4998 1.5851 1.4708 1.2572 1.5705 1.4687 1.5841 2.7970 1.3624 1.2224 1.2516 1.3183 2.5107 1.4309 2.1222 2.7853 1.5682 1.4595 1.4221 1.7074 1.3939 1.2635 1.2180 1.4333 3.3009 1.9027 1.1524 1.0823 1.0539 1.0772 1.0907 1.0593 1.0501 1.0752 1.0476 1.0798 7.5066 9.5908 7.5820 8.1527 1.0713 1.0720 1.0660 1.0625 1.0365 1.0361 1.0607 1.0614 1.0819 1.0855 1.0877 1.0931 1.0984 1.1040 1.1002 1.0980 1.0992 1.1003 1.1005 1.0933 1.0760 1.0638 1.0667
irintensity: 0.1022 0.0939 0.3589 0.0997 0.0443 0.3397 1.6298 0.4488 5.6049 0.1722 0.8517 1.7907 0.1568 2.1447 0.3006 0.3307 12.8434 2.6365 1.7851 3.3494 0.2513 0.0231 0.2493 1.2889 1.5850 173.8401 3.0336 1.9989 0.5978 2.1480 0.9694 9.4366 8.1988 4.0894 3.0429 6.5595 0.9186 2.9133 2.4653 15.3195 43.6524 25.7862 10.7970 9.9996 5.9152 9.8539 116.9055 37.1742 18.3347 15.1552 37.2261 23.9956 38.2334 8.6529 1.0914 17.9114 2.9103 0.6139 15.7683 9.8940 25.7708 4.0239 21.1232 53.9689 78.6232 21.0347 7.7200 27.8808 0.5874 21.8805 136.1388 6.5686 38.7438 25.0099 9.5295 13.8599 53.7315 117.4481 8.9751 20.3773 22.5898 29.7985 15.5194 0.1821 33.8151 22.9319 8.6581 4.1282 5.0140 35.7921 23.3044 30.2471 21.4766 45.6086 4.0765 14.3896 7.2810 14.8682 5.5876 27.0419 18.9933 9.9727 134.9121 397.7133 21.7429 1.7557 13.4907 10.0565 22.8934 8.4862 14.4661 14.0254 13.7482 6.4120 35.3200 21.9809 111.6948 200.3100 163.4714 141.6457 47.4553 64.6363 36.8168 24.9363 19.8867 10.5315 11.5179 6.2318 12.1838 7.1232 3.9223 63.1151 1.1540 86.0753 50.7126 31.8929 32.2919 0.1602 17.1838 20.5625 3.8411
temp: 298.150 k
press: 1.00000 atm
elementType: 53 53 53 8 8 8 8 7 7 6 6 6 6 6 6 6 6 6 6 6 6 6 6 6 6 6 1 1 1 1 1 1 1 1 1 1 1 1 1 1 1 1 1 1 1 1 1 1 1
symmnumber: 1
zpe: 986678.0 jmol-1
zpe.correction: 0.375806 hartree
zpe.thermalcorrener: 0.407126 hartree
zpe.thermalcorrenthalpy: 0.408070 hartree
zpe.thermalcorrgfe: 0.303918 hartree
zpe.sumelectzpe: -1104.513271 hartree
zpe.sumelectthermal: -1104.481951 hartree
zpe.sumelectthermalent: -1104.481007 hartree
zpe.sumelectthermalfe: -1104.585159 hartree
dipole: 0.9658 0.5890 -3.0172
dipole: 3.2223
quadrupole: -201.0851 -195.9597 -190.4216
quadrupole: -2.8680 -8.4674 -1.0091
quadrupole: -5.2630 -0.1376 5.4005 -2.8680 -8.4674 -1.0091
hfenergy: -1104.8890771 hartree
pointgroup: C01 [X(C17H23I3N2O4)]
dipole: -0.2297581 -0.0072083 1.2467254 debye
polarizability: 368.7176359|15.3105055|311.5073381|-53.8445871|21.7792916|211.4375191 unknown
InChI: InChI=1S/C17H23I3N2O4/c1-3-10(17(25)26)7-11-12(18)8-13(19)16(15(11)20)21-14(24)9-22(4-2)5-6-23/h8,10,21,23,25H,3-7,9H2,1-2H3
charge 0 multiplicity 1
49 atoms
I  0.457555 2.183335 0.616036
I  3.964425 -2.061484 -2.382642
I  -1.257983 -3.714453 0.154992
O  4.385505 -0.843837 1.435405
O  6.149671 -0.020969 0.172741
O  -2.767987 -0.660724 -0.931838
O  -5.208772 2.900821 -2.107773
N  -4.911605 0.424242 0.673968
N  -1.314759 -0.470294 0.889792
C  4.035433 1.274381 0.320393
C  3.163624 0.96122 -0.950078
C  4.823705 2.591756 0.116267
C  2.104191 -0.107187 -0.747348
C  -3.69925 -0.071005 1.301644
C  0.884604 0.168444 -0.063453
C  -4.787699 1.704809 -0.05818
C  -0.124148 -0.805912 0.186484
C  4.983884 0.115876 0.604101
C  -6.161762 0.258234 1.446864
C  5.601542 3.042798 1.370256
C  2.238507 -1.43651 -1.241633
C  -2.586243 -0.418133 0.286982
C  0.107087 -2.125104 -0.285744
C  1.266016 -2.43336 -1.022144
C  -5.263404 1.551609 -1.510097
C  -6.585291 -1.212861 1.629218
H  3.362274 1.37489 1.191283
H  2.672879 1.910873 -1.233059
H  3.837581 0.684521 -1.779104
H  5.525379 2.463425 -0.7299
H  4.099264 3.378268 -0.173476
H  -3.266711 0.633684 2.067135
H  -3.927774 -1.009356 1.843523
H  -3.733925 2.039327 -0.07291
H  -5.373166 2.514356 0.430106
H  -6.10382 0.758415 2.447925
H  -6.956648 0.782469 0.884968
H  6.10991 4.006624 1.188049
H  4.925318 3.176361 2.235777
H  6.376043 2.305039 1.645234
H  -1.223462 -0.090856 1.836751
H  1.417619 -3.444625 -1.40329
H  -4.597971 0.835684 -2.028337
H  -6.302354 1.158392 -1.527856
H  -6.653007 -1.711157 0.646746
H  -5.872935 -1.78258 2.254251
H  -7.571275 -1.265978 2.126811
H  5.014501 -1.606449 1.561307
H  -5.303363 2.82618 -3.089447
