program: Gaussian 09
title: 000131725
version: EM64L-G09RevD.01
frameworkgroup: C1[X(C19H26N4O2)]
method: RPBEPBE
basis: SDD
operation: Freq
keyword: #p
keyword: freq=noraman
keyword: PBEPBE/SDD
title: #p freq=noraman PBEPBE/SDD
converged: YES YES NO NO
title: Mulliken charges:
elementType: O O N N N N C C C C C C C C C C C C C C C C C C C H H H H H H H H H H H H H H H H H H H H H H H H H H
charge: -0.288537 -0.305141 -0.061258 -0.435543 -0.349497 -0.249374 -0.143785 -0.133992 -0.485955 -0.484736 -0.454247 -0.492872 0.009920 -0.647167 0.235231 0.269647 0.220876 0.238269 -0.051949 -0.309836 -0.344135 -0.684637 -0.685112 -0.228768 -0.227834 0.228401 0.229757 0.230977 0.224875 0.217771 0.230672 0.212797 0.222712 0.214432 0.213038 0.258471 0.226560 0.227558 0.195107 0.359736 0.204901 0.304743 0.231508 0.214426 0.263097 0.223347 0.223172 0.214378 0.263527 0.228457 0.226015
chargesum: 0.00000
title: Mulliken charges with hydrogens summed into heavy atoms:
elementType: O O N N N N C C C C C C C C C C C C C C C C C C C
charge: -0.288537 -0.305141 -0.061258 -0.075807 -0.349497 -0.249374 0.084616 0.095765 -0.030104 -0.036293 -0.018737 -0.065401 0.268391 0.002057 0.235231 0.269647 0.220876 0.238269 0.152952 -0.005093 -0.112627 0.016233 0.015965 -0.000312 -0.001818
polarizability: 3.06001957e+02 -2.03673037e+01 2.52903372e+02 2.79207748e+00 -1.79269616e+00 1.54669575e+02
1716.lowfreq: -3.4414 -1.2739 0.0003 0.0005 0.0009 6.4002 24.5331 32.7895 42.2163
frequency: 22.7829 32.4508 41.9805 46.3795 69.2084 78.8694 107.3549 115.0586 147.7667 160.5492 184.6540 187.0482 204.8156 207.4402 210.0761 232.7151 246.7746 252.6731 279.5195 284.1997 323.1078 344.6318 361.8511 375.9517 380.3967 391.8932 428.6646 438.3710 449.2564 452.2654 463.4215 503.5937 514.6426 544.4217 576.2651 597.9577 650.2656 687.7736 694.1665 702.8000 717.4579 739.8144 746.7633 747.6179 755.1626 776.0892 782.6877 787.2944 819.6414 827.1416 857.6873 859.1243 864.1740 878.3989 912.8100 924.1184 940.7877 945.6671 960.9527 964.3682 976.3476 979.3147 979.6860 982.5009 1020.9094 1029.0794 1041.3863 1066.1209 1079.5228 1096.0440 1108.7787 1114.1056 1118.7978 1129.8969 1144.6303 1151.2646 1155.3082 1161.4478 1168.7555 1184.2746 1193.5600 1198.8410 1209.1682 1226.1402 1227.4544 1244.6867 1260.5180 1273.7399 1294.5177 1295.6727 1297.5823 1306.8037 1311.5673 1315.2453 1320.5036 1339.2962 1342.1352 1351.5307 1373.6009 1379.6657 1383.3382 1398.3379 1416.0716 1428.8150 1446.5165 1458.7873 1459.4449 1464.4936 1464.8834 1468.0842 1473.0221 1476.8742 1478.8123 1484.3421 1489.8380 1495.8603 1527.2084 1598.1384 1620.7829 1624.4619 1672.8385 2883.7693 2987.1863 2991.1568 2993.7523 2996.7383 3002.4942 3014.6406 3018.0723 3022.5284 3024.3749 3036.3705 3046.3394 3051.4169 3055.9681 3064.6599 3077.2406 3079.8187 3086.5316 3091.2829 3103.5439 3109.7724 3136.5883 3152.3816 3168.2163 3207.6593 3313.7918
redmass: 3.6875 4.3565 4.4732 2.9456 5.8558 4.5494 3.8230 4.4938 4.2046 6.9154 3.4933 1.8551 3.1020 1.1510 1.1058 4.1241 1.7340 1.7149 3.1774 2.2139 4.3127 3.3341 3.6362 2.8111 4.3277 4.7890 3.4103 3.3927 3.4262 4.2315 3.0289 3.3241 6.5596 3.2860 4.0680 3.1612 6.3243 6.8830 9.5587 4.3082 5.1793 4.4262 4.9503 5.0878 1.3522 2.6777 1.7967 1.2370 2.7577 2.8064 2.5019 1.3684 1.5936 3.3026 3.4417 1.1781 1.3631 1.4507 2.2352 4.4937 3.5851 2.4201 2.1468 1.2919 1.9413 1.8851 1.7012 2.2955 2.0883 2.3371 1.7171 1.4531 1.9213 2.2957 2.2854 1.9028 1.4802 2.1623 1.1454 1.9265 2.0528 1.7727 1.6452 1.5151 2.4312 1.5774 1.3896 1.3813 1.5654 1.7782 1.6028 1.4064 1.5102 2.4436 1.4220 5.6184 1.5073 1.4029 1.3840 1.2127 1.2910 1.2309 4.4413 1.1655 1.0885 1.0953 1.0431 2.6222 1.0864 1.0706 1.8887 1.5018 1.0502 1.0522 1.0904 1.0648 1.8275 7.3698 7.8219 8.6741 6.5760 1.0531 1.0595 1.0353 1.0360 1.0602 1.0592 1.0648 1.0841 1.0759 1.0848 1.0868 1.0891 1.1017 1.1035 1.1029 1.1005 1.1046 1.1002 1.0998 1.1012 1.1001 1.0858 1.0916 1.0984 1.0953 1.0822
irintensity: 0.0171 2.1249 0.8539 0.0256 1.3543 1.6439 1.7855 0.8730 0.1079 1.0027 4.2064 0.4074 1.4547 0.2065 0.0155 0.6481 3.1733 5.3982 11.0447 0.7809 2.0322 0.7416 9.8113 1.9467 9.1933 1.1777 10.0313 8.1144 13.4528 0.4536 7.4099 1.1772 9.3047 16.3739 0.3581 15.8602 0.8650 17.6795 3.1262 28.4047 0.3752 0.7649 5.1579 16.3685 84.3388 11.5683 2.3830 98.3373 2.2038 0.5260 5.9320 1.2327 0.4132 1.3804 3.3325 3.8675 5.6563 0.1609 3.0230 1.4745 4.7624 8.6468 2.0904 1.3274 11.7180 20.1474 21.7729 5.9935 31.1835 35.0244 3.9407 1.4705 24.5113 17.9540 9.0916 22.7458 15.7296 125.5208 0.6024 8.3885 78.8314 45.6750 43.8573 5.3949 5.5559 1.6092 6.3273 1.4876 6.5042 34.2799 42.2541 2.8711 16.5923 188.3683 21.4308 183.1533 13.5839 2.9423 6.7612 26.7953 4.4777 33.6350 1.9073 5.9064 5.9634 6.8204 1.9241 6.5779 14.4470 12.0577 30.2759 170.9685 2.1773 1.6918 25.1676 8.2660 911.2406 20.1965 38.6250 6.1943 440.2448 117.9373 27.8641 26.2683 22.4327 20.2315 17.1555 45.9715 9.1298 52.0773 13.0654 72.6306 16.4752 25.5729 3.8107 31.8897 34.7928 76.6853 14.3459 55.2186 2.9809 22.8834 2.1693 21.5132 21.1941 3.7464 196.6213
temp: 298.150 k
press: 1.00000 atm
elementType: 8 8 7 7 7 7 6 6 6 6 6 6 6 6 6 6 6 6 6 6 6 6 6 6 6 1 1 1 1 1 1 1 1 1 1 1 1 1 1 1 1 1 1 1 1 1 1 1 1 1 1
symmnumber: 1
zpe: 1126280.7 jmol-1
zpe.correction: 0.428978 hartree
zpe.thermalcorrener: 0.451897 hartree
zpe.thermalcorrenthalpy: 0.452841 hartree
zpe.thermalcorrgfe: 0.376411 hartree
zpe.sumelectzpe: -1107.258763 hartree
zpe.sumelectthermal: -1107.235844 hartree
zpe.sumelectthermalent: -1107.234900 hartree
zpe.sumelectthermalfe: -1107.311330 hartree
dipole: 1.3200 1.4284 -0.0908
dipole: 1.9471
quadrupole: -113.7498 -151.9634 -149.8866
quadrupole: 5.7888 1.9475 -1.5768
quadrupole: 24.7835 -13.4302 -11.3533 5.7888 1.9475 -1.5768
hfenergy: -1107.6877407 hartree
pointgroup: C01 [X(C19H26N4O2)]
dipole: 0.5135816 -0.5678676 0.0242313 debye
polarizability: 306.4226768|19.8901522|252.5282784|-1.6592079|0.6955971|154.6239491 unknown
InChI: InChI=1S/C19H26N4O2/c1-12(2)22-16-6-4-5-7-17(16)23(19(22)25)18(24)20-13-10-14-8-9-15(11-13)21(14)3/h4-7,12-15,20H,8-11H2,1-3H3
charge 0 multiplicity 1
51 atoms
O  -0.269279 2.081523 0.200685
O  0.961958 -2.039754 0.059703
N  -5.05696 -0.930374 -0.501957
N  -0.986958 -0.150142 0.205278
N  1.325083 0.350489 0.102062
N  3.125034 -1.020348 -0.02281
C  -4.568051 0.333893 -1.147068
C  -4.721992 -0.671965 0.937127
C  -5.066718 1.493915 -0.207041
C  -5.167725 0.814615 1.201757
C  -3.022631 0.256417 -1.200089
C  -3.192244 -0.857746 1.100946
C  -2.425778 0.172213 0.233892
C  -6.493088 -1.206378 -0.739726
C  -0.040469 0.837067 0.170974
C  2.480539 1.180239 0.062814
C  1.728007 -1.023415 0.047306
C  3.607842 0.309923 -0.01508
C  3.948141 -2.259112 -0.098118
C  2.635977 2.577809 0.088183
C  4.918922 0.816365 -0.069163
C  3.639953 -3.043276 -1.393828
C  3.763248 -3.117375 1.173801
C  3.956758 3.085768 0.033075
C  5.078612 2.222863 -0.044015
H  -4.973959 0.414612 -2.170829
H  -5.253766 -1.393385 1.582162
H  -6.051343 1.868832 -0.53873
H  -4.370264 2.351137 -0.212864
H  -4.523704 1.306383 1.952582
H  -6.202652 0.8470 1.58613
H  -2.739959 -0.647933 -1.770261
H  -2.603346 1.139639 -1.71757
H  -2.896795 -0.745727 2.161632
H  -2.938786 -1.886686 0.780468
H  -2.506648 1.171451 0.69954
H  -6.772367 -2.14022 -0.219672
H  -6.655724 -1.361685 -1.821291
H  -7.189489 -0.402031 -0.399868
H  -0.664713 -1.132382 0.151735
H  4.996311 -1.909685 -0.138058
H  1.7614 3.226636 0.147264
H  5.790474 0.157331 -0.128764
H  4.304575 -3.922911 -1.464127
H  2.594241 -3.392984 -1.392106
H  3.801855 -2.412729 -2.285945
H  4.015059 -2.539994 2.080942
H  4.426119 -3.999927 1.127828
H  2.720293 -3.466092 1.253714
H  4.110465 4.169798 0.050622
H  6.087444 2.647139 -0.085244
