program: Gaussian 09
title: 000131723
version: EM64L-G09RevD.01
frameworkgroup: C1[X(C12H15N5O4)]
method: RPBEPBE
basis: SDD
operation: Freq
keyword: #p
keyword: freq=noraman
keyword: PBEPBE/SDD
title: #p freq=noraman PBEPBE/SDD
converged: YES YES NO NO
title: Mulliken charges:
elementType: O O O O N N N N N C C C C C C C C C C C C H H H H H H H H H H H H H H H
charge: -0.262437 -0.239975 -0.460477 -0.443705 -0.170159 -0.257432 -0.434735 -0.039179 -0.034712 0.161198 -0.155442 0.174343 -0.323398 0.012024 0.210802 0.394238 -0.307875 -0.231611 -0.327315 -0.400498 -0.795517 0.218056 0.269347 0.276805 0.304839 0.337231 0.264445 0.201088 0.184157 0.200418 0.249382 0.242548 0.255737 0.241094 0.349956 0.336757
chargesum: 0.00000
title: Mulliken charges with hydrogens summed into heavy atoms:
elementType: O O O O N N N N N C C C C C C C C C C C C
charge: -0.262437 -0.239975 -0.110522 -0.106948 -0.170159 -0.257432 -0.097504 -0.039179 -0.034712 0.161198 -0.155442 0.174343 0.164006 0.288829 0.210802 0.394238 -0.003036 0.032835 0.057930 0.049302 -0.056138
polarizability: 2.26912827e+02 -2.21453364e+01 2.09317395e+02 1.70021590e+01 1.17912618e+01 1.12667845e+02
1716.lowfreq: -7.4022 -5.3265 0.0002 0.0005 0.0006 1.6483 13.1305 24.7663 37.8558
frequency: 13.0130 24.6814 37.8303 60.0508 78.3611 85.5340 107.3966 128.6071 146.1183 158.6322 171.6406 195.7724 206.9576 217.0209 224.5563 234.8452 250.2164 314.6976 329.6579 342.3584 356.8280 375.3658 390.8659 400.1643 416.9655 485.9518 525.5697 528.4670 564.7943 570.8827 608.3300 635.5018 665.6910 683.0825 693.2231 714.2014 754.5122 756.1667 785.0104 788.5041 793.9522 801.4467 874.8683 926.3129 956.2892 972.8362 977.8839 993.8470 997.9392 998.8271 1018.0659 1036.3436 1051.6707 1053.8944 1078.9384 1116.8035 1139.2822 1173.2048 1184.7577 1202.5327 1212.0605 1243.2931 1247.9453 1264.3496 1289.4260 1309.9617 1316.2909 1323.4350 1333.8916 1338.3806 1349.6581 1369.1477 1379.7619 1393.0751 1405.7018 1412.5379 1413.8998 1450.8985 1462.4682 1466.3721 1466.9067 1468.4110 1476.2843 1520.8350 1590.9988 1631.7497 1680.9527 2936.0213 2979.7316 2980.8802 2994.4933 3022.9027 3039.2230 3053.4323 3100.2932 3107.9279 3112.9655 3228.9273 3270.2899 3579.0534 3582.6421 3611.1415
redmass: 6.1728 6.5606 4.8993 3.9724 3.5272 5.2829 4.5876 1.2109 4.2574 3.9814 3.3877 2.7559 3.6825 4.1693 1.3321 2.2907 1.4561 6.1030 6.0459 5.4074 3.4591 4.8685 5.8349 4.1186 4.9743 3.9379 3.6198 4.9394 1.3182 7.0658 2.8577 4.5371 7.0055 5.1430 8.5234 5.9536 7.6815 6.0640 6.5179 1.4212 2.4894 1.8364 1.9022 5.2782 4.8162 2.1339 4.5542 3.4784 2.1201 2.6321 4.1569 3.1545 1.4539 1.7848 3.1816 2.4254 1.1875 2.7377 2.4127 1.5045 1.2569 1.6700 1.9109 2.2183 3.4398 1.4424 3.7319 1.8534 2.9626 1.2156 1.3603 1.3629 2.8414 1.2698 1.4724 1.3195 6.3603 1.4347 1.0799 1.1439 1.0425 1.9370 1.2481 6.4021 8.6192 6.1488 11.2153 1.0550 1.0389 1.0682 1.1019 1.0892 1.0562 1.0985 1.0983 1.0966 1.1112 1.0983 1.1004 1.0669 1.0668 1.0814
irintensity: 2.5457 0.0220 1.3300 1.4854 8.5097 3.6560 6.4445 0.1966 7.7086 2.3228 11.6251 55.7375 2.4947 2.0789 79.5198 54.6699 128.9591 3.4671 1.1736 0.4863 1.4446 0.3584 2.5000 21.3616 3.8359 2.0713 17.6731 14.4229 79.6694 3.4012 16.5991 25.2154 14.7244 4.1327 12.5857 56.3246 29.2275 33.8381 12.7665 29.5566 24.5532 14.3086 21.4318 6.3605 46.1947 3.1661 162.8343 89.6028 4.0236 19.1336 46.1013 117.4371 7.0895 4.0221 53.5965 29.7752 28.2813 9.9097 50.1127 21.1813 16.3563 12.5127 14.3114 19.7473 16.8789 15.3507 44.9087 59.5697 16.4781 4.3677 15.7512 1.5909 47.1135 5.9599 1.1554 11.2131 2.2219 15.8293 4.6103 10.1668 17.1327 79.1702 3.8788 139.3669 478.7544 19.8436 547.8599 76.6079 41.5725 37.6526 33.3850 24.7495 30.1549 16.8236 19.4498 9.2474 7.1166 0.1675 12.6991 5.9583 3.2323 80.9734
temp: 298.150 k
press: 1.00000 atm
elementType: 8 8 8 8 7 7 7 7 7 6 6 6 6 6 6 6 6 6 6 6 6 1 1 1 1 1 1 1 1 1 1 1 1 1 1 1
symmnumber: 1
zpe: 722522.6 jmol-1
zpe.correction: 0.275194 hartree
zpe.thermalcorrener: 0.295358 hartree
zpe.thermalcorrenthalpy: 0.296303 hartree
zpe.thermalcorrgfe: 0.224284 hartree
zpe.sumelectzpe: -1039.352592 hartree
zpe.sumelectthermal: -1039.332428 hartree
zpe.sumelectthermalent: -1039.331483 hartree
zpe.sumelectthermalfe: -1039.403502 hartree
dipole: -4.6846 -8.3260 -3.3306
dipole: 10.1173
quadrupole: -95.4505 -122.6176 -124.8889
quadrupole: -20.1886 -2.3120 -1.9038
quadrupole: 18.8684 -8.2986 -10.5699 -20.1886 -2.3120 -1.9038
hfenergy: -1039.627786 hartree
pointgroup: C01 [X(C12H15N5O4)]
dipole: 1.8572873 2.4912073 -2.4876626 debye
polarizability: 224.1254296|-29.5882916|190.2035956|-12.1983043|-40.4185501|134.5690415 unknown
InChI: InChI=1S/C12H15N5O4/c1-7-2-17-11(20)9-10(15-12(17)14-7)16(5-13-9)6-21-8(3-18)4-19/h2,5,8,14,18-19H,3-4,6H2,1H3
charge 0 multiplicity 1
36 atoms
O  3.187865 -0.672042 0.55127
O  -3.439367 -1.412758 1.893876
O  3.954777 0.346743 -2.083662
O  3.09428 3.008052 1.217149
N  1.035825 -1.808174 0.428907
N  -2.501394 0.143771 0.38794
N  -1.928218 1.777778 -1.011005
N  -0.210563 0.115459 -0.484166
N  -0.566237 -2.755672 1.772163
C  -0.105709 -1.012935 0.294083
C  -1.095624 -1.617016 1.129524
C  -1.438675 0.640702 -0.386779
C  2.338232 -1.582484 -0.208165
C  3.11165 0.750411 0.135266
C  -2.425993 -1.057628 1.237012
C  -3.277492 2.00164 -0.637548
C  -3.626662 0.98416 0.228509
C  0.696879 -2.833294 1.338699
C  4.257376 1.057184 -0.83018
C  3.18739 1.555982 1.448375
C  -4.066675 3.164881 -1.154344
H  2.872491 -2.546017 -0.228273
H  2.180008 -1.203054 -1.231264
H  2.145637 0.948892 -0.368151
H  -4.555526 0.773691 0.747416
H  -1.364147 2.355127 -1.631385
H  1.41721 -3.593475 1.634454
H  5.213945 0.705483 -0.388349
H  4.306657 2.153669 -1.009387
H  4.105936 1.285432 2.009444
H  2.313895 1.301283 2.068222
H  -3.60379 4.129971 -0.874305
H  -5.083905 3.146195 -0.732457
H  -4.158377 3.141348 -2.25667
H  4.730967 0.397234 -2.694327
H  3.987132 3.367159 0.988907
