program: Gaussian 09
title: 000131717
version: EM64L-G09RevD.01
frameworkgroup: C1[X(C22H29ClN2O4S)]
method: RPBEPBE
basis: SDD
operation: Freq
keyword: #p
keyword: freq=noraman
keyword: PBEPBE/SDD
title: #p freq=noraman PBEPBE/SDD
converged: YES YES NO NO
title: Mulliken charges:
elementType: Cl S O O O O N N C C C C C C C C C C C C C C C C C C C C C C H H H H H H H H H H H H H H H H H H H H H H H H H H H H H
charge: -0.023615 0.991839 -0.415182 -0.238392 -0.523860 -0.540713 -0.525399 -0.003951 -0.005809 -0.438575 -0.434604 -0.429129 -0.374668 -0.418670 -0.395484 -0.516285 -0.547531 -0.377732 0.470399 0.189974 -0.337591 -0.512676 -0.070537 -0.198417 -0.350974 -0.236405 -0.213537 -0.181374 -0.191963 -0.101911 0.227291 0.193548 0.194859 0.183907 0.239800 0.203634 0.217976 0.247690 0.205274 0.206807 0.210120 0.214594 0.197422 0.254166 0.254569 0.218139 0.199682 0.219808 0.260679 0.299871 0.235958 0.240286 0.374964 0.286668 0.293808 0.290841 0.238450 0.271160 0.270800
chargesum: 0.00000
title: Mulliken charges with hydrogens summed into heavy atoms:
elementType: Cl S O O O O N N C C C C C C C C C C C C C C C C C C C C C C
charge: -0.023615 0.991839 -0.040218 -0.238392 -0.523860 -0.540713 -0.225528 -0.003951 0.221482 -0.050169 -0.010897 -0.007519 0.078296 -0.001743 0.016532 -0.007550 -0.129710 0.102755 0.470399 0.189974 -0.101632 -0.272390 -0.070537 0.088251 -0.112524 0.057403 0.077305 0.089786 0.078837 -0.101911
polarizability: 4.05189924e+02 -1.66395907e+01 2.64841507e+02 -4.15461608e+00 1.36502565e+00 2.30621913e+02
1716.lowfreq: -8.8579 -2.1080 -0.0017 -0.0012 -0.0007 1.7623 7.0227 10.1753 11.5996
frequency: -6.7313 8.9853 11.2909 17.4098 25.1007 29.3757 32.1026 40.0702 48.1361 49.4870 56.0271 74.9532 92.0211 99.2973 116.7149 121.0912 134.6985 153.2215 171.9137 181.2252 195.5137 205.6370 212.6493 228.0756 243.6264 253.6617 261.9639 278.2934 292.6512 302.8540 316.2031 324.1171 367.2309 368.4569 390.2595 395.1527 407.1388 409.2968 426.9040 446.0235 470.2586 479.8997 488.8071 502.0428 502.7804 518.9987 551.9648 577.1535 592.9059 611.3047 618.7823 644.7841 695.5056 699.8243 719.2163 722.8434 734.8559 744.3401 769.6907 772.7393 805.3126 812.6002 819.2701 830.9848 832.3351 833.1200 856.5304 881.7219 921.1978 928.4077 930.5703 942.6222 946.5920 958.5573 962.5229 972.2089 976.7528 983.2019 991.7867 1008.5480 1016.6137 1021.8270 1030.3683 1037.8700 1043.4971 1047.6518 1051.8729 1066.3135 1077.7671 1081.2288 1091.1529 1104.1972 1111.4434 1124.5322 1131.6570 1150.3672 1174.5365 1178.9167 1183.1172 1199.9581 1201.5162 1214.3750 1222.6058 1231.4137 1255.2415 1258.7095 1272.7478 1281.4581 1287.2457 1289.4510 1306.9201 1308.6191 1313.2119 1322.2796 1329.5815 1340.1350 1345.4898 1351.4238 1355.4228 1360.7898 1367.8567 1369.9066 1372.7075 1377.4072 1380.1966 1413.1742 1438.3543 1448.4667 1456.8004 1458.3884 1459.3465 1465.4494 1470.5572 1470.8503 1478.6197 1483.4062 1491.7901 1557.9945 1566.3006 1584.8325 1592.0959 1665.8792 2935.1540 2949.8896 2961.8616 2962.7674 2963.6940 2976.0981 2977.7426 2978.8344 2985.0715 2996.2549 3002.3869 3012.2957 3014.3167 3023.1564 3039.3874 3043.3396 3051.7173 3056.9088 3059.5823 3104.4898 3126.1223 3131.9036 3155.3150 3156.2342 3160.4667 3177.5502 3180.0289 3428.2030 3509.2245
redmass: 6.9107 8.4838 9.6835 5.1774 5.6160 6.3389 6.8360 4.4086 6.9924 5.1248 4.9240 5.6176 4.6501 4.1259 3.4046 5.2907 3.9369 3.5479 2.8057 3.3549 2.9667 2.7231 7.3781 3.0976 3.5644 5.1577 3.1516 4.1221 4.8884 2.4118 3.9070 2.2616 4.0668 3.8482 4.4852 5.4259 3.5803 2.9232 5.1898 2.6113 3.6163 2.6896 6.5351 2.0326 3.9680 3.2777 2.8143 2.7100 3.5704 7.1174 6.6451 1.3662 4.7995 4.0952 2.2753 1.9501 1.3629 1.3736 2.6664 3.0877 2.4530 3.9838 1.9013 1.4993 1.3087 1.4431 1.9654 1.9294 1.5718 1.9501 1.6462 3.0268 2.3897 1.3244 2.1913 1.3842 2.5539 6.8611 2.3420 3.0599 1.3725 2.0778 3.1057 2.6324 2.7399 2.4272 2.3966 3.0608 2.4282 2.4637 1.6033 1.3515 2.2706 1.9239 1.9487 1.4487 1.1303 1.2641 1.2828 1.3974 1.2711 1.2982 1.4613 1.6279 1.6106 1.3530 1.2498 1.2331 1.1631 1.1250 1.2555 3.2295 1.5401 1.4050 1.2454 1.4117 1.3559 1.2507 1.3931 1.5304 1.5671 1.4256 1.4439 2.9641 10.2611 2.0424 1.0898 2.1177 1.1956 1.1426 1.4803 1.1843 1.0838 1.0797 1.0776 1.0882 1.0906 5.1767 6.1150 5.9142 8.1553 8.0341 1.0659 1.0607 1.0634 1.0650 1.0683 1.0687 1.0639 1.0628 1.0640 1.0653 1.0949 1.0976 1.0978 1.0960 1.1007 1.1008 1.0959 1.0994 1.0948 1.0908 1.0889 1.0912 1.0899 1.0898 1.0999 1.0962 1.0973 1.0762 1.0639
irintensity: 0.2929 0.0507 0.4343 0.7899 1.5097 0.6344 0.4556 0.4863 0.2481 0.4336 2.8495 3.6618 0.2196 1.8642 1.5812 2.1427 4.2036 6.5803 0.5205 1.1251 0.0332 1.8065 2.8707 1.7069 2.4090 0.8521 6.8038 1.6871 4.8657 3.3678 12.0036 6.2536 12.4331 23.3946 58.9839 35.2639 2.3031 0.3690 58.5217 5.2213 6.0556 6.5450 37.6299 51.1328 98.7885 17.6987 11.3420 4.4609 5.2099 0.3530 1.0688 135.8471 13.1010 29.1153 26.1781 15.4292 19.1253 3.7999 11.7442 0.7578 64.5214 88.3060 22.4578 14.5931 2.5259 32.5895 26.8624 2.5402 2.7375 2.3032 4.3711 33.2638 19.6084 0.2277 25.9308 0.5791 15.1476 37.9310 2.4461 19.8754 0.8549 23.9620 77.0474 94.7223 17.3584 69.7291 46.8068 61.2226 8.5038 2.5245 5.3829 11.9267 29.5501 5.0958 4.3746 24.5840 8.5627 15.8054 1.1044 5.6385 6.8774 4.0103 3.2875 0.1341 10.8333 1.9721 0.3314 2.2121 3.0220 10.5313 2.3258 1.9611 1.3635 3.4935 1.5479 8.9241 5.2513 1.4527 14.0145 2.1341 37.8492 1.9427 3.7150 13.8691 4.1267 21.8742 30.1934 61.2295 18.3278 0.8129 5.0066 14.3082 11.3978 0.7397 21.9078 29.8984 4.6789 6.4450 26.9695 1.5190 1.9163 177.8469 45.4025 12.5620 10.1592 45.3706 16.7029 13.3404 10.6015 54.2693 57.1669 26.9245 46.0441 4.0010 8.8525 17.1249 36.0630 89.8808 13.7316 49.5246 33.6531 33.8243 19.3894 25.8326 2.6090 1.9729 6.9053 0.0567 3.9718 17.4089 21.7532
temp: 298.150 k
press: 1.00000 atm
elementType: 17 16 8 8 8 8 7 7 6 6 6 6 6 6 6 6 6 6 6 6 6 6 6 6 6 6 6 6 6 6 1 1 1 1 1 1 1 1 1 1 1 1 1 1 1 1 1 1 1 1 1 1 1 1 1 1 1 1 1
symmnumber: 1
zpe: 1242120.2 jmol-1
zpe.correction: 0.473099 hartree
zpe.thermalcorrener: 0.504126 hartree
zpe.thermalcorrenthalpy: 0.505070 hartree
zpe.thermalcorrgfe: 0.404399 hartree
zpe.sumelectzpe: -2121.815384 hartree
zpe.sumelectthermal: -2121.784356 hartree
zpe.sumelectthermalent: -2121.783412 hartree
zpe.sumelectthermalfe: -2121.884083 hartree
dipole: 2.5440 -5.8109 -4.8794
dipole: 8.0030
quadrupole: -172.9489 -220.4323 -190.6613
quadrupole: 1.1170 1.8153 -10.5116
quadrupole: 21.7319 -25.7514 4.0195 1.1170 1.8153 -10.5116
hfenergy: -2122.2884824 hartree
pointgroup: C01 [X(C22H29Cl1N2O4S1)]
dipole: 0.9861591 -2.1036528 -2.1250633 debye
polarizability: 405.3668644|-13.0403526|263.7638371|-10.5950521|4.3222011|231.5226424 unknown
InChI: InChI=1S/C22H29ClN2O4S/c23-20-10-12-21(13-11-20)30(28,29)25-16-2-1-5-18(9-14-22(26)27)6-3-7-19-8-4-15-24-17-19/h4,8,10-13,15,17-18,25-26H,1-3,5-7,9,14,16H2
charge 0 multiplicity 1
59 atoms
Cl 9.061448 -1.284885 -0.773315
S  2.94989 0.493368 0.393338
O  -7.453616 -2.234867 1.473825
O  -5.681837 -3.673051 1.056923
O  2.61324 0.047212 1.917373
O  2.797581 2.015582 -0.16194
N  1.823853 -0.497995 -0.656114
N  -2.120818 4.419082 1.576324
C  -3.576188 -1.502398 -0.403082
C  -2.272195 -2.077781 -1.022745
C  -3.55592 0.049775 -0.272968
C  -4.801294 -2.030278 -1.20399
C  -0.974378 -1.693874 -0.278031
C  -3.259311 0.823961 -1.579007
C  0.264031 -2.393869 -0.877931
C  -6.166432 -1.814014 -0.51932
C  -3.38241 2.364301 -1.415841
C  1.605636 -1.913122 -0.274132
C  -2.427369 2.975555 -0.399019
C  -6.356865 -2.677051 0.715027
C  -1.026193 2.75368 -0.442215
C  -2.909318 3.817665 0.636799
C  4.743887 -0.027234 0.049553
C  -0.187018 3.360324 0.51739
C  -0.776588 4.183895 1.504632
C  5.457423 0.661316 -0.946415
C  5.291221 -1.064885 0.823169
C  6.791686 0.271059 -1.198748
C  6.625421 -1.453868 0.566495
C  7.346985 -0.784117 -0.444084
H  -3.654393 -1.916982 0.624444
H  -2.361994 -3.184131 -1.041625
H  -2.192889 -1.757846 -2.083487
H  -4.529156 0.396779 0.132143
H  -2.805327 0.338475 0.487382
H  -4.829959 -1.551892 -2.202648
H  -4.667976 -3.115873 -1.37544
H  -0.812959 -0.600866 -0.308073
H  -1.067575 -1.968745 0.79272
H  -3.955392 0.507504 -2.381572
H  -2.241055 0.574857 -1.936744
H  0.198779 -3.488601 -0.7120
H  0.2816 -2.248155 -1.978531
H  -6.991809 -2.069185 -1.21461
H  -6.334473 -0.759846 -0.23514
H  -3.211247 2.836726 -2.405179
H  -4.422486 2.615412 -1.126913
H  2.435107 -2.576145 -0.604755
H  1.550006 -1.946174 0.829159
H  2.050429 -0.316829 -1.647457
H  -0.586983 2.109789 -1.213796
H  -3.985104 4.022349 0.721104
H  -7.568042 -2.833827 2.261378
H  0.893485 3.186331 0.497447
H  4.998332 1.496928 -1.484651
H  4.706646 -1.533386 1.621449
H  -0.163367 4.673084 2.270174
H  7.387789 0.782401 -1.959356
H  7.093959 -2.25344 1.146727
