program: Gaussian 09
title: 000131700
version: EM64L-G09RevD.01
frameworkgroup: C1[X(C12H16N2O4)]
method: RPBEPBE
basis: SDD
operation: Freq
keyword: #p
keyword: freq=noraman
keyword: PBEPBE/SDD
title: #p freq=noraman PBEPBE/SDD
converged: YES YES NO NO
title: Mulliken charges:
elementType: O O O O N N C C C C C C C C C C C C H H H H H H H H H H H H H H H H
charge: -0.205969 -0.212073 -0.459309 -0.255327 -0.453267 0.001887 -0.587315 0.357668 -0.350224 0.076484 -0.347326 0.181574 0.366871 -0.391457 -0.873833 -0.385435 -0.698143 0.203694 0.251875 0.206462 0.240719 0.189400 0.212424 0.186426 0.281058 0.268645 0.239709 0.236023 0.308599 0.218775 0.205992 0.218411 0.368058 0.398925
chargesum: 0.00000
title: Mulliken charges with hydrogens summed into heavy atoms:
elementType: O O O O N N C C C C C C C C C C C C
charge: -0.205969 -0.212073 -0.060384 -0.255327 -0.085210 0.001887 -0.128978 0.357668 0.079895 0.076484 0.051524 0.181574 0.366871 -0.110400 -0.129457 -0.076835 -0.054966 0.203694
polarizability: 2.47565734e+02 1.60122538e+01 1.85565715e+02 6.47406810e+00 -7.44348072e+00 9.29925851e+01
1716.lowfreq: -7.4489 -0.0004 0.0002 0.0003 1.1600 4.8749 36.8899 40.6797 54.1125
frequency: 36.8081 40.6634 54.1081 58.6207 72.6214 85.2476 119.8917 131.8459 146.5155 170.8530 195.3704 216.4535 243.7668 249.7257 269.0497 271.4398 312.8037 333.7331 391.6140 400.3946 416.3524 456.9370 498.4705 503.8407 522.1247 559.3009 584.4888 608.1118 647.8519 666.3364 690.1974 714.4590 730.7391 737.3405 756.1832 786.2308 794.9195 854.7088 860.7722 898.1487 908.7319 934.9784 965.5101 989.1298 1006.5043 1038.0143 1052.1809 1066.9424 1086.8804 1104.2795 1121.1977 1162.6042 1194.8141 1204.2197 1212.5286 1226.4171 1257.4862 1269.1173 1279.6621 1290.8051 1302.7256 1324.2440 1345.2770 1351.2569 1381.1519 1391.3598 1400.1889 1431.3632 1442.2106 1466.3933 1469.7572 1475.7235 1479.4361 1487.2411 1491.0680 1509.3454 1531.6744 1593.4401 1600.2086 1688.1264 2961.0569 2963.5380 2974.0375 2977.3337 3000.5549 3014.6530 3026.4794 3049.8104 3070.3592 3075.0765 3079.4697 3133.1559 3179.0211 3198.1014 3551.7192 3588.3382
redmass: 4.5025 5.0153 5.7071 10.0828 4.5692 1.7458 4.3398 5.5402 2.4331 3.1367 1.2823 4.2844 1.1304 3.8567 6.1423 6.7486 5.5793 4.7803 3.0360 5.6817 2.4438 4.8156 1.6640 1.6970 5.0370 4.9715 4.5787 4.6822 2.6420 2.2124 6.3205 3.3324 1.6400 2.3460 5.2128 1.2800 6.4776 2.5507 1.5226 1.8614 2.6955 1.5869 3.0788 1.3230 3.6240 1.5370 1.9459 2.5631 1.6416 2.1778 2.0638 3.2571 1.5006 2.2770 4.3812 1.7294 1.3121 1.9168 1.2315 1.0774 2.4769 1.3905 2.3327 2.9388 5.1826 1.2146 1.2765 3.7437 2.3855 1.0808 1.1770 1.0733 1.0501 1.0731 1.1661 1.1555 1.9289 5.0793 6.1788 7.2440 1.0435 1.0603 1.0388 1.0619 1.0673 1.0953 1.0981 1.0962 1.0997 1.0993 1.0987 1.0902 1.0896 1.0968 1.0754 1.0653
irintensity: 0.3076 1.4980 0.1446 1.1290 1.8471 0.0593 0.3753 0.8600 0.6275 0.7349 2.3620 1.2058 0.0775 3.0093 0.6920 3.1131 0.4647 4.7447 3.8820 9.3517 0.4691 19.2331 110.2577 94.1070 11.9611 7.9002 4.4422 4.2039 9.6205 6.4904 12.2654 51.4155 2.8276 13.6469 9.0198 0.5734 30.1353 18.0161 53.4471 3.8553 5.5310 17.7984 125.1027 3.5755 2.5630 2.2583 152.9822 7.0039 210.3761 55.7158 143.9082 1.6797 15.1790 2.7823 332.9411 104.1319 3.9924 9.1418 9.3701 6.5014 54.9351 1.7084 52.5570 60.3709 46.6525 14.1765 14.4278 129.3252 1.9777 5.1686 46.1856 18.4579 17.3120 23.1217 41.3879 69.6122 378.1099 35.4147 227.2500 323.9977 23.5232 30.2766 27.3869 40.0001 28.8566 11.1592 15.8452 8.0327 41.5498 49.4845 45.9721 10.2012 3.1476 4.6413 48.8089 105.5576
temp: 298.150 k
press: 1.00000 atm
elementType: 8 8 8 8 7 7 6 6 6 6 6 6 6 6 6 6 6 6 1 1 1 1 1 1 1 1 1 1 1 1 1 1 1 1
symmnumber: 1
zpe: 708583.7 jmol-1
zpe.correction: 0.269885 hartree
zpe.thermalcorrener: 0.288148 hartree
zpe.thermalcorrenthalpy: 0.289093 hartree
zpe.thermalcorrgfe: 0.222434 hartree
zpe.sumelectzpe: -875.867887 hartree
zpe.sumelectthermal: -875.849624 hartree
zpe.sumelectthermalent: -875.848680 hartree
zpe.sumelectthermalfe: -875.915338 hartree
dipole: -2.8731 -6.1760 0.8469
dipole: 6.8641
quadrupole: -105.3942 -115.1507 -107.0073
quadrupole: -1.5712 0.9322 -2.3074
quadrupole: 3.7899 -5.9667 2.1768 -1.5712 0.9322 -2.3074
hfenergy: -876.1377723 hartree
pointgroup: C01[X(C12H16N2O4)]
dipole: -1.182216 2.4108918 -0.2878023 debye
polarizability: 248.428206|-14.3232054|185.1899669|-4.485788|-5.416909|92.5058613 unknown
InChI: InChI=1S/C12H16N2O4/c1-3-4-5-9-8(2)10(13-12(15)16)6-7-11(9)14(17)18/h6-7,13,15H,3-5H2,1-2H3
charge 0 multiplicity 1
34 atoms
O  1.590526 -3.603344 -0.309896
O  2.945121 -1.869586 0.271336
O  -4.978026 1.701815 0.097268
O  -4.626335 -0.583753 0.493718
N  -2.867054 0.918727 -0.072485
N  1.787053 -2.348915 -0.057356
C  2.063148 0.589126 -0.806396
C  0.735947 -0.054352 -0.423175
C  2.767112 1.299643 0.38393
C  -0.46149 0.720955 -0.402588
C  4.120528 1.920756 -0.027329
C  0.617581 -1.444536 -0.112141
C  -1.712341 0.097196 -0.084677
C  -0.624099 -2.055058 0.17525
C  -0.458833 2.212168 -0.709916
C  -1.794341 -1.290697 0.198489
C  4.815466 2.651951 1.141221
C  -4.173578 0.547268 0.201302
H  2.757591 -0.1699 -1.200987
H  1.899249 1.32037 -1.620351
H  2.930808 0.558682 1.187853
H  2.107624 2.08915 0.799309
H  4.78265 1.118247 -0.409179
H  3.965553 2.627454 -0.869157
H  -0.649864 -3.127554 0.382591
H  0.549284 2.594138 -0.915725
H  -1.079917 2.449795 -1.597133
H  -0.845535 2.801831 0.145721
H  -2.758518 -1.743621 0.434029
H  5.004309 1.95925 1.98236
H  4.188939 3.480658 1.522264
H  5.786646 3.078138 0.829847
H  -2.748026 1.910419 -0.286668
H  -5.917679 1.452379 0.289772
