program: Gaussian 09
title: 000131689
version: EM64L-G09RevD.01
frameworkgroup: C1[X(C8H11NO2S)]
method: RPBEPBE
basis: SDD
operation: Freq
keyword: #p
keyword: freq=noraman
keyword: PBEPBE/SDD
title: #p freq=noraman PBEPBE/SDD
converged: YES YES NO NO
title: Mulliken charges:
elementType: S O O N C C C C C C C C H H H H H H H H H H H
charge: 0.223825 -0.418860 -0.238411 -0.579403 -0.066390 -0.515641 -0.410563 -0.136072 -0.298678 0.194888 -0.144913 -0.515375 0.244992 0.240745 0.232970 0.232889 0.221003 0.278149 0.285942 0.281896 0.243318 0.262278 0.381411
chargesum: 0.00000
title: Mulliken charges with hydrogens summed into heavy atoms:
elementType: S O O N C C C C C C C C
charge: 0.223825 -0.037449 -0.238411 -0.011565 0.178602 -0.041925 0.043329 -0.136072 -0.020529 0.194888 0.098405 -0.253097
polarizability: 1.29931623e+02 1.14689078e+01 1.19130900e+02 -3.68440866e+00 1.60448299e+01 8.80652034e+01
1716.lowfreq: -10.4070 -0.0022 -0.0016 -0.0016 3.9543 7.2000 28.2316 50.1505 67.6485
frequency: 28.0778 50.1100 67.6324 82.4183 106.7883 153.5010 190.0530 224.4428 236.6077 302.7869 323.2211 348.0055 422.3565 427.2990 494.1432 541.2388 562.2603 591.5657 595.8527 668.1330 676.3031 692.8116 708.1154 805.0611 818.4165 830.5645 859.1714 905.1916 937.2307 950.7853 1008.8013 1055.0944 1061.2119 1082.4910 1115.5344 1124.4356 1160.5029 1183.7106 1240.5468 1269.2749 1292.1381 1305.0505 1317.9448 1328.7695 1338.8024 1359.1195 1452.8493 1455.0003 1482.6846 1553.0337 1631.7585 1662.5603 2983.7942 2987.3185 2988.9379 3051.4494 3079.0531 3167.5581 3184.4585 3237.6891 3519.9184 3531.2802 3667.3953
redmass: 6.4722 8.6842 6.6199 3.1687 3.2182 3.6528 2.8978 4.6777 1.2467 1.1921 5.0293 3.7563 3.2952 2.9291 4.7740 3.3073 3.3921 2.7572 2.1544 2.6138 4.7788 1.1904 4.7645 2.0355 3.8904 1.3011 2.3925 1.3862 2.6382 2.4363 2.9263 1.6027 1.8495 1.2526 2.9491 1.9343 2.1675 1.2745 1.3477 1.3359 1.4096 2.2107 1.2697 1.2017 2.0609 1.3814 1.0915 1.0912 6.9704 5.6902 1.1011 8.3974 1.0712 1.0659 1.0691 1.1044 1.0974 1.0902 1.0973 1.1004 1.0640 1.0443 1.1018
irintensity: 0.2611 1.0019 2.6131 5.9639 2.4304 2.4379 33.0895 3.0654 277.2683 144.9257 4.6848 18.0049 31.1934 7.4853 44.7800 26.0139 4.4677 35.0055 51.3293 67.5020 12.6288 105.1640 8.0853 8.1195 16.3963 12.5219 18.8546 0.8736 11.3569 36.2974 7.4020 134.8643 34.9176 16.1191 43.5658 53.3550 14.7340 33.5656 21.2831 8.0303 9.2206 39.5347 11.9738 10.4838 2.9562 1.0973 18.2127 7.6608 10.4291 5.4623 42.8182 231.7745 10.3329 40.5758 11.2966 23.3737 15.0090 5.8867 2.4268 0.7745 27.1806 11.6478 7.3722
temp: 298.150 k
press: 1.00000 atm
elementType: 16 8 8 7 6 6 6 6 6 6 6 6 1 1 1 1 1 1 1 1 1 1 1
symmnumber: 1
zpe: 469416.5 jmol-1
zpe.correction: 0.178791 hartree
zpe.thermalcorrener: 0.191769 hartree
zpe.thermalcorrenthalpy: 0.192713 hartree
zpe.thermalcorrgfe: 0.137915 hartree
zpe.sumelectzpe: -913.780896 hartree
zpe.sumelectthermal: -913.767918 hartree
zpe.sumelectthermalent: -913.766974 hartree
zpe.sumelectthermalfe: -913.821772 hartree
dipole: 1.0774 0.9233 0.6612
dipole: 1.5654
quadrupole: -70.0753 -84.9388 -76.5001
quadrupole: 7.0026 2.5846 -1.9632
quadrupole: 7.0961 -7.7674 0.6713 7.0026 2.5846 -1.9632
hfenergy: -913.9596876 hartree
pointgroup: C01 [X(C8H11N1O2S1)]
dipole: 0.5187085 -0.1645077 -0.2884189 debye
dipolederiv: -0.1363744 0.0069892 0.0391723 -0.0271016 -0.0156495 -0.1971698 -0.0243562 -0.1811009 -0.1860344 -0.5046418 -0.1228525 0.1956055 -0.1759818 -0.4040954 0.2710868 0.2599929 0.3031013 -0.9952013 -0.3752729 0.0314276 0.1220184 -0.0221058 -0.8571156 -0.3421224 0.1289871 -0.0995325 -0.7409208 -0.7736003 0.2847919 0.0571891 0.3835469 -1.1952416 -0.0334167 0.1070962 -0.0394058 -0.180382 0.0001065 0.1426777 0.0058256 0.3507905 -0.1461477 -0.0556361 -0.0521641 0.0865256 0.0861721 -0.0195882 0.059952 -0.0309536 -0.0289158 -0.4281839 -0.029894 -0.0050814 -0.0798131 0.0590183 0.6121858 -0.3443734 -0.0728358 -0.4928984 0.6269943 0.0115338 -0.0380035 -0.08019 0.1743455 0.3652553 0.0191182 0.1628881 0.0822897 -0.1462578 0.2312539 0.0881973 0.2724598 0.1904256 -0.1734746 0.0810995 0.0771134 0.0443224 -0.161557 -0.0063937 0.0964624 -0.0444586 -0.2050813 0.3510975 0.009926 -0.3558553 0.1782784 1.3587444 0.0820406 -0.4356982 -0.1622361 1.3002786 0.0677893 -0.0663087 -0.083127 -0.0314745 -0.1222127 0.0106597 0.0380074 -0.0086995 -0.1428862 -0.1121036 -0.1054657 -0.1559959 -0.1308863 -0.1589995 0.2623138 -0.1974978 0.2439715 0.0509589 -0.0248204 -0.003144 0.0261432 -0.020792 0.0747905 0.0149684 0.0582421 0.0180601 -0.0836106 0.1093269 -0.0141535 0.0803709 -0.0288152 0.0332315 0.0167671 0.0245644 0.0309747 -0.0669636 -0.1020268 -0.0408525 -0.017223 0.0362886 0.1696453 0.0291559 0.0268806 0.0553326 0.1015637 -0.048636 -0.0485305 -0.0777237 -0.0479913 -0.0291492 -0.0447082 -0.1254218 -0.0544713 0.0089963 0.0497723 0.0075199 0.0560528 0.0342096 0.0354643 0.0127444 0.0620313 0.0822562 -0.1100759 0.0984557 -0.0176833 -0.0560871 -0.0181063 0.1228106 -0.0851194 -0.0951175 -0.0768231 0.0572759 0.0967683 -0.0074354 -0.0304485 -0.1329396 0.4286753 -0.0894065 -0.0128361 -0.0826013 0.104291 0.126657 0.0154898 0.0224454 -0.0788672 0.4010155 0.1228641 0.01113 0.0657774 0.0883347 0.030896 0.0474865 0.0514368 0.0753707 0.1219235 -0.097057 0.094968 -0.0972615 0.0561818 -0.0230598 0.0003364 -0.0340796 0.0176214 0.1803799 -0.0612471 -0.0117346 -0.0639039 0.1205529 0.3852882 0.0639848 0.0180679 0.0341577 0.1109349 -0.0232174 0.0013514 -0.0879619 0.3127608 unknown
polarizability: 134.8444389|-8.5389721|103.0960451|-0.1801434|20.4835703|99.1872417 unknown
InChI: InChI=1S/C8H11NO2S/c9-5-6(4-8(10)11)7-2-1-3-12-7/h1-3,6,10H,4-5,9H2
charge 0 multiplicity 1
23 atoms
S  -1.966594 -1.074024 -1.332029
O  1.908602 1.951483 -0.835431
O  1.210045 2.483242 1.31365
N  2.35918 -2.662373 -0.343565
C  0.688332 -0.700866 -0.290948
C  1.571152 0.115512 0.689744
C  0.983383 -2.245271 -0.107905
C  -0.783695 -0.405274 -0.120629
C  -1.461583 0.293618 0.870253
C  1.523981 1.611886 0.472791
C  -2.896962 0.317861 0.704277
C  -3.337694 -0.362181 -0.416886
H  1.001193 -0.430636 -1.320166
H  1.287972 -0.084438 1.737254
H  2.616112 -0.22152 0.539807
H  0.311121 -2.795904 -0.793558
H  0.690743 -2.537216 0.918557
H  -0.953705 0.804415 1.692048
H  3.035619 -2.572998 0.411618
H  2.735633 -2.565069 -1.285373
H  -3.572756 0.830504 1.393151
H  -4.351473 -0.503595 -0.786879
H  1.851495 2.939342 -0.94368
