program: Gaussian 09
title: 000131688
version: EM64L-G09RevD.01
frameworkgroup: C1[X(C12H16FN3O3S)]
method: RPBEPBE
basis: SDD
operation: Freq
keyword: #p
keyword: freq=noraman
keyword: PBEPBE/SDD
title: #p freq=noraman PBEPBE/SDD
converged: YES YES NO NO
title: Mulliken charges:
elementType: S F O O O N N N C C C C C C C C C C C C H H H H H H H H H H H H H H H H
charge: 0.757703 -0.202215 -0.617416 -0.645369 -0.279264 0.052901 -0.117881 -0.252079 -0.392194 -0.369353 -0.386655 -0.378114 0.248459 -0.176929 -0.787173 -0.193473 -0.152181 -0.349655 -0.347758 0.332131 0.261997 0.294651 0.262842 0.247404 0.239376 0.252591 0.281176 0.237523 0.340503 0.238116 0.239436 0.273679 0.296914 0.265629 0.262431 0.262248
chargesum: 0.00000
title: Mulliken charges with hydrogens summed into heavy atoms:
elementType: S F O O O N N N C C C C C C C C C C C C
charge: 0.757703 -0.202215 -0.617416 -0.304866 -0.279264 0.052901 -0.117881 -0.252079 0.164453 0.140893 0.105312 0.140585 0.248459 -0.176929 -0.035942 0.103440 0.113448 -0.087224 -0.085510 0.332131
polarizability: 2.62426280e+02 -9.77006315e+00 1.78086455e+02 2.77511147e+01 2.00305041e+01 1.30747572e+02
1716.lowfreq: -10.4172 0.0016 0.0018 0.0021 1.6997 5.9073 8.9619 14.2345 24.2827
frequency: -3.2907 14.1962 24.2269 33.4057 61.6170 66.2143 82.4100 89.3121 99.6989 118.6538 147.0013 163.2188 171.7998 195.3727 249.3857 277.3084 297.1758 314.2827 334.2289 345.5700 361.3270 390.5729 411.1279 427.6768 433.2893 442.2934 489.4574 512.4051 526.5300 567.3303 571.6851 575.1707 596.7456 618.4125 648.2517 680.5310 707.5642 707.9058 772.8652 782.6439 812.4332 823.2882 839.4144 912.5449 940.9201 953.2754 971.5241 971.9404 992.4619 996.7628 1007.8334 1032.2906 1040.3043 1043.9715 1062.2844 1096.1358 1116.8182 1123.8684 1150.7390 1170.7237 1190.1468 1221.1433 1225.8788 1252.0716 1270.8922 1275.6278 1310.9773 1335.0450 1340.6114 1361.5539 1379.4515 1386.4969 1392.2688 1413.3849 1415.8187 1433.9984 1444.9060 1449.9301 1463.8037 1465.2637 1467.9841 1482.7644 1519.3547 1589.0816 1597.5123 1606.0587 2085.2734 2976.5679 2985.3970 2991.3319 3022.4527 3033.2734 3077.5141 3083.6119 3106.0514 3115.3034 3121.1702 3133.8791 3137.4128 3159.3497 3176.1651 3182.2578
redmass: 4.4047 7.7029 4.3617 5.2741 7.6358 6.3957 8.5643 5.7219 3.4587 6.1339 3.9747 1.1494 8.6168 5.6492 6.2828 8.3235 2.3246 10.5118 7.6816 4.8619 2.4144 6.0066 2.9887 2.9806 7.3947 2.6232 2.6750 3.0275 5.1177 4.9882 3.2789 8.3543 9.7664 7.3706 3.5222 4.4178 2.8903 2.9605 1.7475 6.4564 1.3945 8.4079 1.4982 2.7562 1.3607 2.5579 1.3627 1.7844 1.9435 4.5142 2.2423 1.6657 2.1319 2.4804 2.4102 1.2794 1.8361 1.3095 1.2949 1.2489 2.8718 2.3847 1.4889 1.4695 1.4657 1.2456 1.3159 1.2578 1.3228 1.3394 1.2146 4.4796 5.4520 2.6891 1.0729 1.0922 1.1086 1.0888 1.0737 2.3968 1.1017 1.0779 5.5227 6.3087 6.8294 8.2416 1.0972 1.0709 1.0667 1.0385 1.0609 1.0600 1.0984 1.0965 1.0920 1.1066 1.1050 1.0978 1.0900 1.0893 1.0952 1.0973
irintensity: 1.3863 0.1239 0.0517 0.7974 6.8570 2.1362 4.3814 1.1357 2.1786 9.1831 2.5433 1.8040 9.0036 18.2155 49.9807 22.9329 7.2644 1.9454 27.0912 19.7590 2.5838 3.2025 0.4085 17.3997 11.9957 3.3207 9.0661 28.5927 130.8346 11.3632 5.3122 0.8897 28.3142 1.0805 9.7230 4.2743 8.3277 3.8535 12.1324 24.3017 15.1986 33.2187 78.4430 2.3567 0.1517 3.6818 5.5698 28.6490 20.4549 11.6071 20.7585 3.8757 22.1272 18.8624 79.1196 11.8861 101.4908 250.9530 57.5547 3.9855 57.2536 2.4014 71.0806 161.2278 32.9497 4.3315 15.6316 2.5921 20.2830 35.6587 27.4269 0.7244 5.4788 191.9829 28.7442 29.8424 22.1167 27.3290 7.2711 97.1747 30.6690 3.9889 151.4127 40.8358 271.4108 5.8510 3737.7439 28.5508 38.2715 6.4780 7.8594 9.8141 13.2310 9.0090 7.3955 11.5328 7.7988 8.9385 4.8435 0.4440 4.3448 4.9540
temp: 298.150 k
press: 1.00000 atm
elementType: 16 9 8 8 8 7 7 7 6 6 6 6 6 6 6 6 6 6 6 6 1 1 1 1 1 1 1 1 1 1 1 1 1 1 1 1
symmnumber: 1
zpe: 712061.8 jmol-1
zpe.correction: 0.271210 hartree
zpe.thermalcorrener: 0.291178 hartree
zpe.thermalcorrenthalpy: 0.292122 hartree
zpe.thermalcorrgfe: 0.219630 hartree
zpe.sumelectzpe: -1353.043629 hartree
zpe.sumelectthermal: -1353.023662 hartree
zpe.sumelectthermalent: -1353.022718 hartree
zpe.sumelectthermalfe: -1353.095209 hartree
dipole: 1.1077 0.5806 -1.2407
dipole: 1.7617
quadrupole: -149.8011 -118.7031 -127.0605
quadrupole: 2.6123 -6.6965 -0.0104
quadrupole: -17.9462 13.1518 4.7944 2.6123 -6.6965 -0.0104
hfenergy: -1353.3148394 hartree
pointgroup: C01 [X(C12H16F1N3O3S1)]
dipole: 0.4973719 0.4789209 -0.0602474 debye
polarizability: 253.1026378|-44.8979879|133.8196685|-1.5845571|10.607473|184.3380006 unknown
InChI: InChI=1S/C6H5FO2S.C6H11N3O/c7-5-1-3-6(4-2-5)10(8)9;1-6(10)8-2-4-9(7)5-3-8/h1-4,8H;2-5H2,1H3
charge 0 multiplicity 1
36 atoms
S  -1.957206 -1.316602 -0.672998
F  -6.237335 2.253067 1.682101
O  -1.020637 -1.646364 0.654785
O  -1.175341 0.02422 -1.641565
O  6.336371 -0.718178 0.419544
N  1.948962 -0.938258 -1.691684
N  4.253825 0.051679 -0.259431
N  1.071035 -0.944647 -2.601137
C  1.788699 -0.304142 -0.307911
C  3.318255 -1.570254 -1.884679
C  2.944803 0.692529 -0.053094
C  4.429781 -0.53618 -1.599119
C  5.266828 -0.094183 0.697102
C  -3.292381 -0.175967 0.02629
C  5.031661 0.527478 2.071702
C  -3.380373 -0.082905 1.425732
C  -4.155097 0.522819 -0.839831
C  -4.377639 0.741123 1.992931
C  -5.155222 1.348989 -0.280292
C  -5.239799 1.431687 1.122425
H  1.795173 -1.123261 0.431938
H  0.804329 0.187963 -0.281883
H  3.345053 -1.932976 -2.923357
H  3.398018 -2.418163 -1.180593
H  2.838963 1.555469 -0.742078
H  2.858354 1.074659 0.974801
H  5.419122 -1.022391 -1.624529
H  4.403079 0.260806 -2.368783
H  -0.286657 -0.378504 -2.124358
H  4.163275 0.077456 2.586723
H  4.868276 1.61862 2.010262
H  5.931059 0.339513 2.675438
H  -2.662481 -0.636342 2.042679
H  -4.037195 0.452985 -1.925235
H  -4.488758 0.849415 3.075467
H  -5.845999 1.919841 -0.906866
