program: Gaussian 09
title: 000131682
version: EM64L-G09RevD.01
frameworkgroup: C1[X(C17H19FN2O2)]
method: RPBEPBE
basis: SDD
operation: Freq
keyword: #p
keyword: freq=noraman
keyword: PBEPBE/SDD
title: #p freq=noraman PBEPBE/SDD
converged: YES YES NO NO
title: Mulliken charges:
elementType: F O O N N C C C C C C C C C C C C C C C C C H H H H H H H H H H H H H H H H H H H
charge: -0.210303 -0.294710 -0.261983 -0.294148 -0.611551 -0.508239 -0.185556 0.446170 -0.701723 -0.349960 -0.460847 0.375611 -0.383804 -0.343727 0.207966 -0.380947 0.415122 -0.550481 -0.391579 0.353689 -0.186374 -0.391736 0.222946 0.212295 0.208295 0.272874 0.209784 0.240897 0.233208 0.267262 0.233843 0.247165 0.244886 0.225564 0.224946 0.299822 0.229783 0.313904 0.332985 0.231786 0.256867
chargesum: 0.00000
title: Mulliken charges with hydrogens summed into heavy atoms:
elementType: F O O N N C C C C C C C C C C C C C C C C C
charge: -0.210303 -0.294710 -0.261983 -0.021274 0.035339 -0.072998 0.022739 0.446170 -0.017834 -0.082698 -0.227005 0.375611 -0.136639 -0.098841 0.207966 0.069563 0.415122 -0.250659 -0.161796 0.353689 0.045413 -0.134870
polarizability: 3.12228439e+02 1.38145867e+00 1.97718197e+02 -1.59649646e+01 -5.37899801e+00 1.14091367e+02
1716.lowfreq: -11.0880 -2.7661 -0.0008 0.0003 0.0006 6.2686 9.9616 15.5870 25.5883
frequency: -1.8998 15.5567 25.5216 29.0139 31.2210 51.6815 68.2887 100.7877 105.1958 142.8072 161.4771 177.6306 211.1935 214.9111 226.0825 239.0593 263.5911 275.2340 321.0181 343.2692 380.8508 405.9713 415.3250 443.6798 471.0726 481.7777 503.8892 507.7850 511.8696 541.1788 550.5356 587.9490 602.2558 619.2592 632.5843 686.8559 691.0415 718.5112 726.5533 733.5491 756.7698 774.1499 783.1732 809.8737 830.4799 840.3253 877.2449 904.5973 911.8560 931.9685 938.4737 968.6841 970.2917 984.1426 988.4222 1000.1820 1006.3061 1019.2490 1035.3920 1054.7531 1066.5222 1080.5612 1112.8626 1126.8059 1127.6901 1159.3478 1173.5779 1179.2456 1210.6005 1211.5795 1225.9173 1229.7848 1239.5072 1257.4291 1275.1060 1284.6047 1304.8774 1334.1516 1351.4348 1361.5239 1385.8249 1394.3366 1397.8570 1416.7311 1440.7475 1454.2832 1468.5173 1469.7368 1478.8738 1480.5381 1481.4089 1502.4080 1587.2994 1592.6447 1598.2897 1624.0589 1626.3395 1641.0277 2900.1820 2934.8275 2969.0615 2974.7576 2985.6885 2988.0506 3085.5309 3101.1607 3120.5379 3124.5352 3145.1721 3153.3742 3159.3766 3166.8659 3179.9561 3196.4295 3426.0840 3509.2497 3663.9019
redmass: 5.4085 5.6904 3.7861 4.7249 5.5962 5.7707 5.8771 3.7029 4.3629 5.3805 4.1080 2.9454 1.1607 3.2265 4.3578 3.4199 2.8611 4.6387 4.1243 4.6797 5.2659 4.0898 2.9577 2.9930 3.6766 3.6420 3.2103 2.1199 1.9206 3.8217 3.8493 1.3341 3.9567 3.1274 6.8056 2.3519 1.9732 3.5891 4.2062 4.4196 2.4225 4.0084 1.4102 1.4699 3.2489 1.6892 1.3044 1.3864 1.6270 1.3532 3.5005 1.3258 1.3873 1.5999 6.2136 6.5558 2.6303 1.7373 1.6060 3.3428 1.9323 1.5944 1.3219 2.7903 1.6828 1.9222 1.1504 1.2017 2.0736 1.1071 4.4523 1.4726 3.2125 1.5323 1.3501 1.4123 1.3825 2.1648 1.7947 1.6492 1.3827 3.7413 3.3575 3.0584 2.7221 1.1059 1.1912 1.0835 1.3798 1.7338 1.0917 2.3318 6.8136 1.4430 6.8618 6.5277 6.8314 3.4772 1.0657 1.0551 1.0926 1.0840 1.1048 1.0352 1.0999 1.1006 1.0894 1.0886 1.0877 1.0926 1.0939 1.0969 1.0974 1.0925 1.0737 1.0445 1.1040
irintensity: 0.5815 2.4369 2.6646 4.9203 6.4904 0.8729 1.3835 4.0177 4.3616 0.6774 1.5594 1.0864 3.3165 4.4687 1.7703 0.2319 21.9885 0.4981 1.7376 3.7342 4.5708 1.2265 0.3820 5.1129 9.2144 4.9694 13.5649 44.3349 105.9540 5.3272 0.0491 128.4190 5.2903 3.9956 2.7411 27.5184 84.2326 6.2352 15.8024 27.2173 20.3473 24.8824 60.8675 36.0568 14.9957 42.9464 6.1221 20.2703 2.2290 5.5579 44.1390 0.5596 10.2710 12.4428 0.0092 51.9905 43.5486 2.2937 18.5362 4.1342 16.5540 1.7255 13.7443 29.7805 26.4624 71.3108 12.3983 52.6456 113.3844 13.3426 189.9723 47.2041 42.9125 15.9599 13.3301 64.9731 3.0760 15.9714 52.4138 0.5917 28.9509 7.5578 33.5763 3.3096 35.4317 24.4124 102.5548 26.6339 6.5361 12.7334 4.5596 133.4938 17.7422 59.9875 41.8053 75.8123 20.0704 258.8843 55.3099 27.8971 21.2138 48.5950 28.0636 24.3498 34.8462 21.2850 18.4848 8.2032 5.2409 15.9114 18.8458 4.9034 6.4076 3.5733 1.3736 27.4937 19.5796
temp: 298.150 k
press: 1.00000 atm
elementType: 9 8 8 7 7 6 6 6 6 6 6 6 6 6 6 6 6 6 6 6 6 6 1 1 1 1 1 1 1 1 1 1 1 1 1 1 1 1 1 1 1
symmnumber: 1
zpe: 859763.1 jmol-1
zpe.correction: 0.327466 hartree
zpe.thermalcorrener: 0.347968 hartree
zpe.thermalcorrenthalpy: 0.348912 hartree
zpe.thermalcorrgfe: 0.275029 hartree
zpe.sumelectzpe: -1017.391045 hartree
zpe.sumelectthermal: -1017.370544 hartree
zpe.sumelectthermalent: -1017.369600 hartree
zpe.sumelectthermalfe: -1017.443483 hartree
dipole: 3.3615 -2.5996 -2.7031
dipole: 5.0363
quadrupole: -94.3551 -124.5696 -134.6831
quadrupole: 21.9830 -23.3124 2.9946
quadrupole: 23.5141 -6.7003 -16.8138 21.9830 -23.3124 2.9946
hfenergy: -1017.7185119 hartree
pointgroup: C01 [X(C17H19F1N2O2)]
dipole: -1.262485 -1.3995846 -0.6110585 debye
polarizability: 311.2303928|20.7036967|122.0432383|-5.3507119|23.482617|190.7643722 unknown
InChI: InChI=1S/C17H19FN2O2/c1-12(17(19)21)20-10-13-5-7-16(8-6-13)22-11-14-3-2-4-15(18)9-14/h2-9,12,20H,10-11,19H2,1H3
charge 0 multiplicity 1
41 atoms
F  6.333914 1.269793 2.446927
O  2.004311 0.17616 0.29019
O  -6.314421 0.846454 -1.546773
N  -4.442027 0.422062 0.640972
N  -7.644874 -0.835855 -0.653907
C  -3.695525 -0.666595 -0.038005
C  -5.886659 0.188553 0.797528
C  -2.192109 -0.42507 0.007519
C  -6.516192 1.336595 1.620467
C  -1.568586 0.041077 1.196386
C  -1.379595 -0.683147 -1.118863
C  0.623238 -0.0449 0.121803
C  -0.176992 0.230726 1.258248
C  0.023371 -0.50218 -1.075737
C  -6.624202 0.096681 -0.573738
C  2.873989 -0.09058 -0.854666
C  4.312704 0.199759 -0.463136
C  4.649538 0.611696 0.84588
C  5.334485 0.047855 -1.435871
C  6.000994 0.858077 1.138444
C  6.682652 0.304128 -1.10477
C  7.036364 0.717032 0.200943
H  -4.011577 -0.813661 -1.097474
H  -3.938409 -1.607165 0.500502
H  -6.018216 -0.7671 1.346098
H  -4.276932 1.324602 0.170009
H  -7.593333 1.166044 1.796224
H  -6.000979 1.416901 2.592508
H  -6.406217 2.295772 1.082303
H  -2.198534 0.265987 2.063176
H  -1.842764 -1.027104 -2.051944
H  0.310596 0.590318 2.169804
H  0.618118 -0.710359 -1.969972
H  2.573898 0.548717 -1.712328
H  2.768949 -1.152274 -1.165687
H  3.875928 0.735521 1.60622
H  5.077768 -0.270201 -2.45371
H  -7.872892 -1.454562 0.122436
H  -8.185754 -0.904455 -1.516625
H  7.463945 0.184389 -1.86253
H  8.071924 0.923407 0.485449
