program: Gaussian 09
title: 000131659
version: EM64L-G09RevD.01
frameworkgroup: C1[X(C20H22N4O)]
method: RPBEPBE
basis: SDD
operation: Freq
keyword: #p
keyword: freq=noraman
keyword: PBEPBE/SDD
title: #p freq=noraman PBEPBE/SDD
converged: YES YES NO NO
title: Mulliken charges:
elementType: O N N N N C C C C C C C C C C C C C C C C C C C C H H H H H H H H H H H H H H H H H H H H H H
charge: -0.264808 -0.474393 -0.393700 -0.064400 -0.572448 0.061575 0.048425 0.130008 0.206355 0.268721 0.040054 0.429638 0.343826 -0.418039 -0.473402 -0.414969 -0.318767 -0.544632 -0.625669 -0.835407 -0.394933 -0.397229 0.312577 -0.375341 -0.536863 0.314836 0.234479 0.236923 0.314281 0.268653 0.234127 0.208729 0.239435 0.252430 0.224402 0.224947 0.237043 0.232017 0.177346 0.255234 0.179838 0.209806 0.259465 0.274497 0.219946 0.220607 0.244777
chargesum: 0.00000
title: Mulliken charges with hydrogens summed into heavy atoms:
elementType: O N N N N C C C C C C C C C C C C C C C C C C C C
charge: -0.264808 -0.159557 -0.079418 -0.064400 -0.038485 0.061575 0.048425 0.130008 0.206355 0.268721 0.040054 0.429638 0.343826 -0.183559 -0.236479 -0.146316 0.124089 -0.305197 -0.373238 -0.149015 0.014430 -0.141995 0.312577 0.014303 0.148468
polarizability: 3.88661773e+02 3.16164787e+01 3.21550008e+02 1.22460300e+01 -1.73243155e+01 1.27319928e+02
1716.lowfreq: -4.8942 -0.6434 -0.0003 0.0005 0.0006 4.4235 21.5664 34.2435 43.1364
frequency: 21.5295 34.2344 43.1265 56.3545 70.9569 97.1882 101.7397 108.7474 124.7920 143.9479 154.3431 166.3935 181.3137 189.6373 197.5673 207.4700 230.8767 232.7530 255.3466 271.2301 303.6388 329.9390 364.6145 381.2528 396.2259 411.8150 421.6388 450.9198 454.6238 476.5914 498.9235 503.7581 507.4533 534.3578 551.1097 563.0374 582.2906 600.6867 614.7547 627.2293 651.2903 674.1143 686.6377 697.1054 753.6842 761.0358 769.1664 793.0885 795.0425 807.1657 846.0264 856.0197 862.3124 871.0486 893.1760 922.6243 944.8796 961.9931 977.3485 985.9221 988.4265 1000.6830 1016.2184 1042.4848 1045.0343 1077.7874 1082.4902 1111.9819 1113.4172 1114.4386 1146.2319 1148.4981 1159.1189 1176.3597 1182.7500 1201.7482 1227.8429 1243.0480 1254.5550 1261.7800 1276.2903 1287.1858 1295.0099 1298.0345 1311.5378 1335.8228 1357.0651 1364.1849 1370.4009 1382.5285 1391.0292 1400.7118 1403.5498 1417.7924 1437.0919 1439.9589 1456.3539 1465.1253 1468.2883 1470.1201 1471.3271 1473.8791 1478.8507 1488.5115 1498.6475 1505.4210 1538.1243 1571.6720 1576.8627 1603.9585 1606.2988 1628.4452 1640.0272 2867.7766 2951.7268 2952.5271 2953.6179 2956.3382 3015.7964 3021.4396 3036.6280 3042.3500 3058.2812 3077.6146 3111.3408 3123.9403 3124.2577 3144.5195 3148.1755 3148.5616 3169.4461 3455.0720 3553.2063 3582.9337 3613.5967
redmass: 4.3470 4.4663 4.2466 1.9657 3.0376 3.7848 3.5239 4.1439 2.1831 3.9201 1.1272 3.9297 3.5049 2.9374 2.8413 3.8232 1.5743 1.6357 2.1936 2.8746 5.1141 4.2689 4.1393 5.3433 4.2913 4.1544 2.6881 3.8456 3.1545 2.4144 3.3786 1.2577 4.1720 2.9888 4.3847 2.8686 5.8945 1.3097 3.8681 4.7966 9.5827 5.0980 6.5505 3.6485 6.1189 1.0897 6.4359 2.1365 2.1414 5.0035 1.6844 4.4260 1.1972 1.8061 1.3828 4.3978 1.3912 2.7871 2.3166 2.8599 1.7141 2.2385 3.3778 1.4667 3.1073 2.4404 2.3903 2.2909 1.2638 2.6333 1.4690 1.3374 1.3523 1.9289 1.8813 2.2428 1.3632 2.1351 1.3081 2.3894 1.7996 1.1199 1.5057 2.6019 1.7095 1.8250 2.0882 3.4836 2.6041 3.6464 1.4963 4.9124 1.3753 2.3296 1.4338 4.4884 2.1642 1.0501 1.0855 1.4396 1.0756 1.2432 1.6243 1.0883 1.1149 2.4382 5.6816 5.4246 6.2678 7.2644 6.8044 6.5519 1.0942 1.0717 1.0695 1.0642 1.0407 1.0331 1.0857 1.0982 1.0903 1.1037 1.0985 1.0957 1.0913 1.0987 1.0870 1.0915 1.0964 1.0880 1.0969 1.0449 1.0774 1.0975 1.0802
irintensity: 0.8189 1.2898 0.6420 4.8486 1.1637 3.6725 0.0079 2.6500 1.4881 2.0474 0.3363 1.5827 2.8021 3.1632 0.7804 9.1320 9.5403 34.8318 26.8066 3.0941 0.4592 0.4359 0.8456 3.4419 12.7988 1.0253 32.1957 5.3196 41.1077 61.5274 22.5350 62.9927 3.8975 14.2147 4.4085 15.2414 14.7589 200.7656 2.2258 3.2305 1.1585 4.6649 4.3976 14.3191 4.4775 7.3229 11.0471 8.9112 10.0038 15.4465 25.1614 7.1583 0.2912 58.8537 12.1949 6.4036 1.6396 6.9921 21.2618 25.6124 16.4211 16.0313 15.6108 4.4256 2.5386 3.6116 2.8943 28.3680 0.1514 28.5496 4.9762 1.7654 3.0430 51.0227 117.4300 33.6597 1.2536 60.8310 17.0646 21.1349 31.7973 4.5379 5.7147 32.3331 3.1965 7.7949 39.5222 102.7350 7.7029 80.6010 26.9046 27.4937 17.2749 1.3156 4.3029 25.2932 28.9205 13.1562 9.5419 75.8522 20.2423 27.6373 2.1407 20.1863 32.4540 163.2431 14.8648 254.4098 67.9406 56.3769 52.5743 78.3378 43.8021 99.1639 59.7006 44.7975 73.1394 72.1466 31.5094 28.6844 9.3737 50.1304 64.6678 18.0571 38.7067 27.6820 6.0183 9.7884 29.1766 4.2795 6.7884 1.3907 24.0157 0.1760 58.9838
temp: 298.150 k
press: 1.00000 atm
elementType: 8 7 7 7 7 6 6 6 6 6 6 6 6 6 6 6 6 6 6 6 6 6 6 6 6 1 1 1 1 1 1 1 1 1 1 1 1 1 1 1 1 1 1 1 1 1 1
symmnumber: 1
zpe: 1007185.3 jmol-1
zpe.correction: 0.383617 hartree
zpe.thermalcorrener: 0.406911 hartree
zpe.thermalcorrenthalpy: 0.407855 hartree
zpe.thermalcorrgfe: 0.330462 hartree
zpe.sumelectzpe: -1067.786175 hartree
zpe.sumelectthermal: -1067.762880 hartree
zpe.sumelectthermalent: -1067.761936 hartree
zpe.sumelectthermalfe: -1067.839329 hartree
dipole: 1.5829 -2.3399 2.3180
dipole: 3.6542
quadrupole: -127.7442 -116.4596 -152.3622
quadrupole: -4.2367 1.9165 4.9564
quadrupole: 4.4445 15.7291 -20.1735 -4.2367 1.9165 4.9564
hfenergy: -1068.1697913 hartree
pointgroup: C01 [X(C20H22N4O1)]
dipole: 0.5104961 0.9872461 -0.9119735 debye
polarizability: 395.1410556|-22.8774939|315.0705283|-9.9528933|-18.7210839|127.3201258 unknown
InChI: InChI=1S/C20H22N4O/c1-12-11-23-20(22-9-3-8-21)18-17-15-6-5-14(25-2)10-13(15)4-7-16(17)24-19(12)18/h4-7,10-11,22,24H,3,8-9,21H2,1-2H3
charge 0 multiplicity 1
47 atoms
O  5.1837 -1.059511 0.398381
N  -1.424839 3.112872 -0.135252
N  -1.448896 -1.647222 -0.020282
N  -3.449199 -0.491512 0.35246
N  -0.958631 -6.572577 -0.250385
C  -0.014139 1.296904 0.034048
C  -1.400636 0.832261 0.135036
C  -2.238516 1.998602 0.07342
C  -0.082732 2.709704 -0.185712
C  1.294395 0.691293 0.151708
C  -2.09492 -0.432205 0.170054
C  2.458688 1.510086 -0.143186
C  -3.649871 1.962285 0.225597
C  1.05439 3.521842 -0.434624
C  2.306464 2.90897 -0.447333
C  1.533098 -0.647647 0.613643
C  -2.184224 -2.922792 -0.0558
C  -4.173435 0.66864 0.409661
C  3.772839 0.937697 -0.08149
C  -4.508211 3.208748 0.196517
C  -1.200552 -4.106778 -0.114244
C  2.818386 -1.182216 0.686416
C  3.949263 -0.395108 0.306798
C  -1.931167 -5.462996 -0.189058
C  6.381545 -0.295193 0.048529
H  -1.755922 4.069317 -0.235506
H  0.949065 4.595975 -0.622232
H  3.204419 3.501136 -0.658085
H  -0.526311 -1.630109 -0.455516
H  0.697264 -1.243836 0.989398
H  -2.81923 -2.982468 0.846032
H  -2.879765 -2.948895 -0.922106
H  -5.249471 0.538083 0.582358
H  4.626857 1.578412 -0.324198
H  -4.215353 3.933909 0.98221
H  -4.449064 3.732341 -0.779024
H  -5.568578 2.953217 0.365326
H  -0.544441 -4.109037 0.776013
H  -0.541954 -4.002557 -1.004682
H  2.992818 -2.19899 1.051417
H  -2.646958 -5.437295 -1.048258
H  -2.539031 -5.592967 0.726957
H  -0.348976 -6.544407 -1.07431
H  -1.364451 -7.502153 -0.107785
H  6.514154 0.575212 0.720947
H  6.343618 0.052895 -1.002581
H  7.220112 -0.995029 0.178222
