program: Gaussian 09
title: 000131655
version: EM64L-G09RevD.01
frameworkgroup: C1[X(C14H23NO)]
method: RPBEPBE
basis: SDD
operation: Freq
keyword: #p
keyword: freq=noraman
keyword: PBEPBE/SDD
title: #p freq=noraman PBEPBE/SDD
converged: YES YES NO NO
title: Mulliken charges:
elementType: O N C C C C C C C C C C C C C C H H H H H H H H H H H H H H H H H H H H H H H
charge: -0.271645 -0.094757 -0.210796 -0.370076 0.542325 -0.715139 -0.438582 -0.408741 -0.693167 0.339905 -0.380170 -0.378673 -0.368920 -0.285388 -0.613545 -0.613006 0.197686 0.194312 0.195985 0.210334 0.209201 0.226598 0.231733 0.224884 0.210786 0.233478 0.204103 0.200462 0.224641 0.245985 0.245414 0.222405 0.203992 0.221664 0.190036 0.229111 0.191817 0.225397 0.220349
chargesum: 0.00000
title: Mulliken charges with hydrogens summed into heavy atoms:
elementType: O N C C C C C C C C C C C C C C
charge: -0.271645 -0.094757 -0.013110 0.020221 0.542325 -0.069006 -0.206848 -0.183857 -0.044800 0.339905 0.044934 -0.132689 -0.123505 0.141009 0.027265 0.024557
polarizability: 2.30849667e+02 5.93400525e+00 1.34107412e+02 -2.02624023e+00 1.35064307e+01 1.32896585e+02
1716.lowfreq: -19.3457 -2.5578 -0.0007 -0.0006 0.0004 4.1668 19.6292 25.1363 33.7049
frequency: 15.6770 24.8010 32.9805 57.0688 62.0587 96.9012 120.7382 132.2332 161.0675 182.1467 204.4808 210.1716 218.0359 220.8709 244.3812 262.3696 269.6116 343.9431 355.7144 389.7114 413.1591 415.2567 440.9513 460.5055 511.7913 539.5138 550.0183 632.0822 688.8434 735.6821 782.1327 799.0411 809.1515 828.5340 836.5797 840.4746 853.5013 936.6042 955.5248 960.9947 981.1584 993.2372 1003.7410 1027.5950 1032.4473 1034.7303 1064.3359 1069.5035 1088.9200 1095.4740 1098.9679 1111.1441 1138.6856 1152.9750 1167.2282 1179.3167 1213.0304 1225.1585 1244.3493 1246.9838 1267.8792 1281.6743 1292.7563 1301.2226 1329.7537 1331.3980 1334.0350 1381.1509 1384.7037 1387.7931 1395.5787 1418.1772 1419.9879 1443.1143 1460.9014 1464.1174 1466.6860 1472.4916 1473.2465 1475.2962 1476.0398 1476.9042 1484.3936 1485.2204 1486.4921 1501.7839 1583.5210 1621.7246 2852.5631 2862.2976 2888.6962 2962.7058 2965.0199 2970.0080 2972.2181 2975.2981 3019.2148 3021.0236 3026.2425 3029.2561 3055.4862 3064.7845 3068.1424 3076.6082 3078.7030 3080.1892 3085.6648 3118.0091 3120.3579 3156.8525 3162.1583
redmass: 2.7655 3.7634 3.0660 3.9071 3.0984 2.6393 2.0170 2.4646 2.3884 3.2090 1.3081 1.9688 1.1259 1.6769 1.2575 2.8251 1.8768 2.7996 3.1841 3.0356 2.9313 2.6846 2.8603 3.1340 3.6152 3.0277 2.4939 6.8769 3.0851 3.3412 2.4553 1.6981 1.3079 1.4429 1.6381 2.4093 2.1487 1.3946 1.2701 1.3691 6.1100 1.8497 2.3064 2.6133 2.1744 1.5650 1.6084 1.5770 1.3898 2.2820 2.5217 1.4878 1.4525 1.8744 1.4321 1.2476 1.9022 3.6836 1.3020 1.8089 2.5498 1.3033 1.1930 1.3233 1.5334 1.4989 1.5040 2.1172 1.2217 1.2352 1.7983 2.9807 1.1468 1.1667 1.0465 1.0661 1.0660 1.1000 1.0533 1.0433 1.0602 1.0723 1.0981 1.0606 1.0848 2.1626 6.9530 6.4472 1.0569 1.0580 1.0687 1.0736 1.0562 1.0566 1.0449 1.0388 1.1007 1.0731 1.0920 1.0803 1.0962 1.0997 1.0992 1.0998 1.0999 1.1008 1.1006 1.0887 1.0888 1.0937 1.0951
irintensity: 0.1908 0.5688 0.5694 0.2770 0.2936 0.4607 1.6791 1.7960 0.4750 0.5102 0.3566 1.1436 0.1970 0.1924 0.6488 1.2534 1.5516 8.9614 4.5087 0.7596 0.1383 0.1420 1.1534 0.2122 8.4839 8.6842 21.2102 0.4982 22.6574 1.6873 7.4489 9.6578 21.6583 2.6794 44.2423 9.3159 3.6525 0.0696 6.7934 0.7244 98.9721 9.8984 3.7944 5.2875 65.8752 12.8732 4.8231 3.3467 13.4114 5.8506 4.9922 11.6464 2.8670 6.9167 12.2043 66.0170 36.5236 216.7517 0.7378 7.5890 16.1300 0.1445 2.9169 4.2822 1.0623 3.1788 17.5936 12.0203 1.3814 19.6040 4.7694 0.5275 3.1274 4.2459 11.2641 2.6978 2.6500 27.6937 16.4111 15.8530 9.3898 1.4333 45.9468 10.5965 21.3937 121.4310 7.3703 55.8340 69.5719 162.9130 116.5941 9.6154 33.8964 14.8807 88.6323 20.1914 33.5763 38.6838 36.4433 30.8108 39.0154 32.2993 69.3145 26.9341 79.1317 33.8737 53.0103 16.9004 24.2527 17.5210 5.6197
temp: 298.150 k
press: 1.00000 atm
elementType: 8 7 6 6 6 6 6 6 6 6 6 6 6 6 6 6 1 1 1 1 1 1 1 1 1 1 1 1 1 1 1 1 1 1 1 1 1 1 1
symmnumber: 1
zpe: 892855.8 jmol-1
zpe.correction: 0.340071 hartree
zpe.thermalcorrener: 0.358581 hartree
zpe.thermalcorrenthalpy: 0.359525 hartree
zpe.thermalcorrgfe: 0.291183 hartree
zpe.sumelectzpe: -675.973999 hartree
zpe.sumelectthermal: -675.955489 hartree
zpe.sumelectthermalent: -675.954545 hartree
zpe.sumelectthermalfe: -676.022887 hartree
dipole: -1.0448 0.8473 0.2959
dipole: 1.3774
quadrupole: -83.3135 -98.8517 -100.4349
quadrupole: -1.0798 -0.1792 2.7622
quadrupole: 10.8866 -4.6517 -6.2349 -1.0798 -0.1792 2.7622
hfenergy: -676.3140703 hartree
pointgroup: C01 [X(C14H23N1O1)]
dipole: -0.4062469 -0.0590178 0.3537359 debye
polarizability: 231.0835481|0.4404914|129.0444107|3.6642249|-12.9165646|137.7257048 unknown
InChI: InChI=1S/C14H23NO/c1-5-12(2)13-6-8-14(9-7-13)16-11-10-15(3)4/h6-9,12H,5,10-11H2,1-4H3
charge 0 multiplicity 1
39 atoms
O  -1.606204 0.520555 -0.760393
N  -5.029467 -0.536104 0.29578
C  4.087449 0.115611 0.215868
C  4.66587 -1.321758 0.067765
C  2.578193 0.177804 -0.035503
C  4.445022 0.706469 1.607188
C  2.038535 1.032942 -1.032676
C  1.666864 -0.589296 0.731647
C  4.508492 -1.911766 -1.349592
C  -0.24048 0.354359 -0.471241
C  -3.964282 0.156939 -0.466159
C  0.650654 1.1273 -1.253943
C  0.270968 -0.513695 0.525918
C  -2.573286 -0.24492 0.043194
C  -6.275152 -0.699348 -0.481237
C  -5.287119 0.070748 1.618789
H  4.57959 0.746353 -0.554016
H  4.175858 -1.988917 0.805851
H  5.740156 -1.293682 0.34118
H  3.998601 0.101888 2.419202
H  5.540971 0.720682 1.758628
H  4.06606 1.739076 1.711447
H  2.718833 1.637662 -1.645262
H  2.045502 -1.264586 1.508847
H  4.943126 -2.926525 -1.410914
H  3.443621 -1.97818 -1.636859
H  5.019853 -1.279332 -2.100347
H  -4.059803 1.269912 -0.427767
H  -4.038165 -0.137913 -1.528225
H  0.237471 1.788913 -2.02177
H  -0.397479 -1.127255 1.137577
H  -2.419845 -1.333214 -0.093974
H  -2.443847 0.002178 1.116574
H  -6.995715 -1.30271 0.099946
H  -6.771076 0.27083 -0.739309
H  -6.061655 -1.236802 -1.42187
H  -5.696538 1.111119 1.550282
H  -6.014619 -0.548337 2.173443
H  -4.359155 0.110798 2.214732
