program: Gaussian 09
title: 000131647
version: EM64L-G09RevD.01
frameworkgroup: C1[X(C15H20N2O)]
method: RPBEPBE
basis: SDD
operation: Freq
keyword: #p
keyword: freq=noraman
keyword: PBEPBE/SDD
title: #p freq=noraman PBEPBE/SDD
converged: YES YES NO NO
title: Mulliken charges:
elementType: O N N C C C C C C C C C C C C C C C H H H H H H H H H H H H H H H H H H H H
charge: -0.247560 0.003861 -0.468522 -0.117231 -0.243855 -0.495822 -0.490006 -0.496114 -0.440014 -0.453278 0.143497 0.316357 0.268235 -0.347796 -0.384654 -0.849102 -0.234014 -0.250404 0.242244 0.237278 0.213953 0.217474 0.268468 0.202836 0.245024 0.218426 0.226642 0.225773 0.228923 0.228893 0.339527 0.307405 0.227065 0.227100 0.229956 0.246178 0.226865 0.226394
chargesum: 0.00000
title: Mulliken charges with hydrogens summed into heavy atoms:
elementType: O N N C C C C C C C C C C C C C C C
charge: -0.247560 0.003861 -0.128995 0.125012 -0.006576 -0.064395 -0.018702 -0.032664 0.012400 0.004537 0.143497 0.316357 0.268235 -0.040391 -0.157589 -0.145869 -0.007148 -0.024010
polarizability: 2.49004800e+02 -1.91842829e+00 1.72025064e+02 8.20613816e+00 -3.14316968e+00 1.13575483e+02
1716.lowfreq: -8.7768 -0.0009 -0.0004 0.0004 4.2113 9.4756 30.3480 34.2595 66.5075
frequency: 26.9860 32.6942 66.4734 73.6521 87.4796 158.1303 190.4294 192.9603 194.3760 220.5564 285.7172 291.5098 301.5185 355.9912 381.3104 400.6243 420.7203 445.2643 502.9678 526.1605 541.3153 550.8663 578.3088 606.8467 639.0133 644.9102 721.6077 730.5408 738.2172 766.6770 769.8350 800.2052 804.4105 817.7744 841.5337 859.7471 874.6912 881.2877 920.8464 948.0850 953.6214 964.1177 979.1288 990.4071 996.6869 1011.7336 1027.9407 1042.5640 1045.7700 1049.4616 1064.2974 1093.4549 1111.5982 1133.2877 1156.9991 1169.6520 1173.3931 1195.9469 1202.6141 1217.1876 1232.5229 1254.0533 1270.2564 1286.4094 1291.9219 1300.6194 1305.6741 1309.7921 1314.9861 1315.9945 1326.9397 1345.8999 1348.6627 1373.3112 1395.4978 1438.0287 1450.5910 1458.4075 1462.2610 1471.3178 1474.3558 1480.9425 1486.9961 1487.4179 1513.5402 1592.9835 1617.3678 1618.7399 2950.9965 2956.3163 2979.3311 2982.0563 2992.7060 2998.5604 3006.3080 3018.8523 3035.0176 3046.0393 3052.1818 3055.3974 3065.7164 3079.9848 3087.1979 3121.2143 3136.5129 3160.2820 3194.6172 3527.7842
redmass: 3.5826 4.6992 4.3694 3.6829 3.3434 3.1560 3.9229 2.8060 1.0933 3.0702 3.2607 2.1130 5.8099 2.9925 2.3549 2.5897 2.9263 2.9708 4.6213 4.5569 3.1078 3.9225 6.7071 6.4607 2.7319 1.5533 3.9349 2.7617 4.3170 1.5066 2.7159 1.5521 2.9928 1.6751 3.5114 2.6582 2.9157 1.3048 4.0069 1.7701 1.3686 2.9619 1.5924 2.4039 1.3084 3.4106 2.7382 1.5268 2.1872 2.7331 2.6838 1.6478 1.8872 1.2987 1.6569 1.4736 1.0874 1.9010 1.5646 1.2322 1.4399 1.3802 2.1737 1.3719 1.5166 1.4822 1.2995 1.3976 1.3363 1.4288 1.2984 1.5167 1.4311 5.7465 1.2692 2.3733 1.8161 1.0823 1.0800 1.0843 1.0858 1.0461 1.0947 1.4073 2.0150 6.9103 6.8319 3.7609 1.0401 1.0819 1.0596 1.0603 1.0598 1.0615 1.0641 1.0978 1.1034 1.1057 1.1033 1.0877 1.1055 1.1031 1.0944 1.0872 1.0901 1.0985 1.0949 1.0755
irintensity: 0.8871 0.5097 1.3623 3.1009 0.2055 0.6335 2.3621 5.2099 0.6042 1.7303 2.0803 1.5405 10.6316 1.0481 0.1915 0.5270 0.1783 8.0428 3.0518 2.5961 5.5780 0.4604 5.3464 16.7561 12.1413 43.4046 3.8892 4.4710 30.5295 57.8252 39.1312 6.0156 4.8337 14.3554 3.8299 2.4345 3.0835 2.9053 52.1287 2.4806 3.5179 8.6423 3.7393 8.6244 2.3305 6.5668 4.2390 6.6991 10.1385 46.4742 4.9515 16.3548 2.2498 6.5072 24.6968 41.8859 0.0794 8.6505 27.1785 1.3973 8.1076 8.8594 45.4418 11.4850 42.5971 62.6770 1.9787 4.0314 1.3505 3.2714 1.5601 1.3967 1.3375 99.8610 23.4590 111.8970 99.6418 14.1008 2.9861 19.4360 7.5268 14.9641 7.7417 75.0783 304.2494 85.7058 41.8725 42.3236 32.2857 14.9900 40.9863 49.5478 32.2013 93.0142 68.4754 23.3514 10.2495 14.7701 7.2736 23.8301 61.4404 56.6803 18.4710 8.8946 19.5793 30.9636 9.0848 16.7270
temp: 298.150 k
press: 1.00000 atm
elementType: 8 7 7 6 6 6 6 6 6 6 6 6 6 6 6 6 6 6 1 1 1 1 1 1 1 1 1 1 1 1 1 1 1 1 1 1 1 1
symmnumber: 1
zpe: 852008.3 jmol-1
zpe.correction: 0.324513 hartree
zpe.thermalcorrener: 0.340424 hartree
zpe.thermalcorrenthalpy: 0.341368 hartree
zpe.thermalcorrgfe: 0.280257 hartree
zpe.sumelectzpe: -766.978157 hartree
zpe.sumelectthermal: -766.962246 hartree
zpe.sumelectthermalent: -766.961302 hartree
zpe.sumelectthermalfe: -767.022413 hartree
dipole: -0.3280 2.9611 -0.9841
dipole: 3.1375
quadrupole: -99.3773 -107.5492 -111.5369
quadrupole: 5.9445 4.6937 -5.0559
quadrupole: 6.7772 -1.3947 -5.3824 5.9445 4.6937 -5.0559
hfenergy: -767.30267 hartree
pointgroup: C01 [X(C15H20N2O1)]
dipole: -0.1316584 1.1516096 -0.4244461 debye
polarizability: 249.0952761|-1.6631203|171.7552514|7.494106|-5.0431871|113.7548197 unknown
InChI: InChI=1S/C15H20N2O/c1-11-4-2-3-5-14(11)16-15(18)13-10-17-8-6-12(13)7-9-17/h2-5,12-13,16H,6-10H2,1H3
charge 0 multiplicity 1
38 atoms
O  -0.139887 -1.860914 -0.262405
N  -3.350003 1.058662 0.943456
N  0.858971 0.26733 -0.31355
C  -2.779952 -0.831826 -0.749262
C  -1.566585 0.129951 -0.610378
C  -3.983027 -0.000043 -1.270943
C  -3.155001 -1.443272 0.630195
C  -1.923404 1.166137 0.547556
C  -4.223364 1.188202 -0.264421
C  -3.583788 -0.274539 1.58623
C  -0.237054 -0.60195 -0.381173
C  2.240553 -0.026408 -0.115921
C  3.151061 1.078727 -0.081035
C  2.718036 -1.355251 0.038853
C  4.525747 0.810311 0.108253
C  2.662045 2.509707 -0.241707
C  4.097141 -1.586268 0.225677
C  5.009372 -0.509021 0.261383
H  -2.526724 -1.642599 -1.45313
H  -1.469385 0.691723 -1.563946
H  -4.876459 -0.649755 -1.332561
H  -3.781651 0.378139 -2.291847
H  -2.292734 -2.004497 1.027682
H  -3.982782 -2.164133 0.493239
H  -1.308059 0.973372 1.446292
H  -1.726605 2.204521 0.218926
H  -4.002984 2.163987 -0.735873
H  -5.273512 1.217025 0.077254
H  -4.656849 -0.332984 1.843633
H  -3.015017 -0.298927 2.53349
H  0.635198 1.25842 -0.428425
H  2.004801 -2.180356 0.009249
H  5.227255 1.652891 0.135901
H  2.176076 2.680161 -1.224234
H  1.938101 2.79722 0.548106
H  3.505239 3.216638 -0.175625
H  4.454648 -2.615335 0.342864
H  6.079883 -0.689444 0.406097
