program: Gaussian 09
title: 000131639
version: EM64L-G09RevD.01
frameworkgroup: C1[X(C16H14N2O4)]
method: RPBEPBE
basis: SDD
operation: Freq
keyword: #p
keyword: freq=noraman
keyword: PBEPBE/SDD
title: #p freq=noraman PBEPBE/SDD
converged: YES YES NO NO
title: Mulliken charges:
elementType: O O O O N N C C C C C C C C C C C C C C C C H H H H H H H H H H H H H H
charge: -0.405597 -0.405581 -0.234792 -0.234958 -0.117575 -0.117569 0.470661 0.470833 -0.609416 -0.609223 -0.544349 -0.544873 0.188980 0.189055 -0.361546 -0.361685 -0.315964 -0.315998 -0.192123 -0.192108 0.212364 0.212316 0.247829 0.250300 0.247926 0.250421 0.258403 0.258351 0.265792 0.266062 0.277956 0.277966 0.230548 0.230555 0.378517 0.378522
chargesum: 0.00000
title: Mulliken charges with hydrogens summed into heavy atoms:
elementType: O O O O N N C C C C C C C C C C C C C C C C
charge: -0.027080 -0.027059 -0.234792 -0.234958 -0.117575 -0.117569 0.470661 0.470833 -0.111287 -0.110877 -0.285946 -0.286521 0.188980 0.189055 -0.095755 -0.095623 -0.038008 -0.038033 0.038425 0.038447 0.212364 0.212316
polarizability: 4.13751121e+02 -3.12744915e+01 2.02805524e+02 1.04535597e-02 1.16827300e-01 1.08173247e+02
1716.lowfreq: -4.7464 0.0004 0.0006 0.0007 3.7540 5.3339 13.1839 18.4595 20.3911
frequency: 13.1588 18.4558 20.3683 29.1104 29.3922 52.3959 58.5053 97.7191 101.7471 124.1852 168.0447 202.2825 225.9635 238.8479 259.3495 279.0231 306.5084 361.4431 385.7424 397.4401 434.6895 441.8109 477.5149 479.8681 523.7236 529.1685 542.3759 545.3037 561.5562 590.3663 642.5401 645.7580 664.7645 690.0432 696.0787 703.7395 723.2574 768.5681 811.7475 813.8892 838.9770 856.3943 859.9035 904.8420 910.8572 927.5441 928.5959 944.0313 948.1697 952.8289 966.0197 986.4921 986.5076 1000.1272 1000.4756 1059.2715 1059.4316 1083.5592 1085.9196 1129.7114 1149.7834 1174.5599 1176.5951 1182.1646 1183.2491 1218.7741 1247.9233 1270.3869 1271.0293 1292.1489 1296.4378 1332.0957 1332.6910 1364.3694 1389.9168 1394.2795 1435.0627 1438.4002 1453.4228 1453.9522 1471.0198 1472.8057 1579.5043 1579.9601 1609.9819 1610.6603 1661.4349 1661.5133 3016.5443 3017.0109 3106.6556 3106.7275 3134.0095 3134.1016 3147.1340 3147.2708 3153.8986 3153.9614 3172.8032 3173.0063 3506.3598 3506.4535
redmass: 6.7636 5.8103 6.5716 9.0649 9.1272 5.3142 5.5615 5.7908 6.9412 6.7091 4.9824 5.2402 4.2553 4.5343 7.0686 5.4119 5.4303 5.2603 2.7899 2.4906 2.9634 3.1326 3.2309 3.3246 5.9100 6.4492 4.4178 4.2886 4.1762 3.2147 1.6613 2.3841 2.5710 2.3409 3.0781 2.0032 4.5492 4.3627 1.7137 1.8782 3.7424 3.1912 3.4613 2.0782 2.2989 2.1385 1.8143 1.4238 1.4591 2.3242 2.4486 5.9819 6.0639 1.3529 1.3561 1.9900 2.0059 1.5507 1.5420 1.8771 1.5549 1.1742 1.2573 1.2276 1.2327 3.0258 3.2095 1.4895 1.5691 1.4198 1.4344 2.0747 1.9842 8.4271 7.1917 7.6456 2.5213 2.9806 1.1527 1.1454 2.2895 2.4727 6.2307 5.9590 6.5182 6.6086 8.5307 8.5345 1.0634 1.0633 1.0987 1.0987 1.0872 1.0872 1.0920 1.0921 1.0940 1.0939 1.0965 1.0965 1.0639 1.0639
irintensity: 0.0009 0.4779 0.5251 2.8892 3.1382 1.0318 2.3219 3.6947 0.8345 1.9141 0.2906 0.4574 0.1840 0.2165 0.0959 1.6773 0.1438 0.0251 10.0420 2.5539 0.0374 1.4287 12.5019 0.4641 53.3834 0.1666 25.6013 60.9027 42.6310 1.5546 178.9306 41.9285 29.3339 52.5756 37.4528 73.2593 0.9741 5.1779 3.7742 70.5694 9.5518 12.0322 3.9636 16.2840 14.9458 3.8410 10.9411 0.3527 9.7184 4.2494 44.1330 0.3351 0.8765 0.1857 1.6516 203.7290 208.2290 27.9600 70.7543 0.0205 41.1496 2.4602 12.0122 16.3388 19.8370 0.7346 63.1634 0.1606 7.4899 12.5086 9.6576 66.4621 91.5193 2.4186 14.0555 1.4630 3.1993 25.6869 24.7521 17.2491 23.1572 2.6587 0.1996 22.3613 20.6510 0.4508 266.0296 161.1812 11.4224 10.7899 3.9013 4.3839 16.2096 0.3554 9.4966 0.5160 10.9704 0.7628 21.7903 0.0318 23.3190 26.0888
temp: 298.150 k
press: 1.00000 atm
elementType: 8 8 8 8 7 7 6 6 6 6 6 6 6 6 6 6 6 6 6 6 6 6 1 1 1 1 1 1 1 1 1 1 1 1 1 1
symmnumber: 1
zpe: 707388.8 jmol-1
zpe.correction: 0.269430 hartree
zpe.thermalcorrener: 0.289439 hartree
zpe.thermalcorrenthalpy: 0.290384 hartree
zpe.thermalcorrgfe: 0.215100 hartree
zpe.sumelectzpe: -1026.922122 hartree
zpe.sumelectthermal: -1026.902112 hartree
zpe.sumelectthermalent: -1026.901168 hartree
zpe.sumelectthermalfe: -1026.976452 hartree
dipole: 0.0029 0.0019 -0.1642
dipole: 0.1642
quadrupole: -123.2880 -119.0660 -121.3014
quadrupole: 16.4982 0.1094 -0.0455
quadrupole: -2.0695 2.1524 -0.0829 16.4982 0.1094 -0.0455
hfenergy: -1027.1915517 hartree
pointgroup: C01 [X(C16H14N2O4)]
dipole: 0.0010949 -0.0646058 -0.0006391 debye
polarizability: 417.7081977|0.1933209|108.1734846|11.2995091|0.1629758|198.8482096 unknown
InChI: InChI=1S/C16H14N2O4/c19-15(20)9-11-3-1-5-13(7-11)17-18-14-6-2-4-12(8-14)10-16(21)22/h1-8,19,21H,9-10H2
charge 0 multiplicity 1
36 atoms
O  -6.147096 1.690622 2.199941
O  6.154847 1.68991 -2.198797
O  -7.060025 1.052528 0.162252
O  7.062752 1.047888 -0.160152
N  -0.498375 -0.340242 0.424486
N  0.4966 -0.340949 -0.424921
C  -4.216683 -0.361453 0.268824
C  4.21495 -0.356745 -0.268884
C  -5.380267 -0.398571 1.262707
C  5.378444 -0.39624 -1.262878
C  -2.883494 -0.355732 0.732742
C  2.881786 -0.354314 -0.732925
C  -1.798192 -0.340905 -0.182097
C  1.796369 -0.338008 0.181752
C  -4.459081 -0.343143 -1.129188
C  4.457185 -0.333732 1.129091
C  -2.046928 -0.326672 -1.582766
C  2.044939 -0.318962 1.58239
C  -3.376763 -0.325519 -2.042472
C  3.374726 -0.314605 2.042183
C  -6.284867 0.816315 1.114617
C  6.287667 0.814925 -1.113417
H  -5.005441 -0.447584 2.296059
H  -6.00444 -1.29114 1.071377
H  5.003294 -0.442459 -2.296245
H  5.99928 -1.291504 -1.073027
H  -2.653112 -0.362326 1.803867
H  2.65147 -0.364577 -1.80404
H  -5.491077 -0.329625 -1.497321
H  5.489123 -0.317877 1.497275
H  -1.196253 -0.315525 -2.270537
H  1.194181 -0.306684 2.27004
H  -3.581267 -0.311357 -3.118765
H  3.579124 -0.296734 3.118442
H  -6.730331 2.486224 2.059353
H  6.741357 2.482972 -2.057466
