program: Gaussian 09
title: 000131630
version: EM64L-G09RevD.01
frameworkgroup: C1[X(C23H26N4O2)]
method: RPBEPBE
basis: SDD
operation: Freq
keyword: #p
keyword: freq=noraman
keyword: PBEPBE/SDD
title: #p freq=noraman PBEPBE/SDD
converged: YES YES NO NO
title: Mulliken charges:
elementType: O O N N N N C C C C C C C C C C C C C C C C C C C C C C C H H H H H H H H H H H H H H H H H H H H H H H H H H
charge: -0.272605 -0.249354 -0.171082 -0.138750 -0.053011 -0.399414 -0.386545 -0.418310 -0.414120 -0.367451 0.436273 0.256269 -0.197274 0.367987 -0.396166 -0.378393 0.066200 -0.670087 -0.531697 -0.409205 -0.390998 -0.698343 0.501203 0.181326 -0.341538 -0.456102 -0.239177 -0.225130 -0.241950 0.234081 0.225572 0.234240 0.224358 0.227847 0.278914 0.230886 0.234324 0.234343 0.238985 0.224866 0.243700 0.238158 0.252124 0.251287 0.220220 0.273341 0.221499 0.236939 0.233321 0.332907 0.247280 0.222724 0.224580 0.224010 0.226935
chargesum: 0.00000
title: Mulliken charges with hydrogens summed into heavy atoms:
elementType: O O N N N N C C C C C C C C C C C C C C C C C C C C C C C
charge: -0.272605 -0.249354 -0.171082 -0.138750 -0.053011 -0.066506 0.073109 0.040288 0.092641 0.097759 0.436273 0.256269 0.037069 0.367987 -0.157181 -0.153527 0.066200 -0.188228 -0.028287 -0.188985 -0.117657 -0.006584 0.501203 0.181326 -0.094257 -0.233379 -0.014597 -0.001120 -0.015015
polarizability: 5.54012888e+02 9.21468314e-01 2.04918241e+02 -3.26644742e+01 6.05550890e+00 2.11954657e+02
1716.lowfreq: -0.0010 -0.0005 0.0010 2.4655 3.5614 7.9799 12.6074 22.0200 25.1893
frequency: 7.7517 21.4975 25.1440 35.7686 39.6345 51.4405 72.4419 79.0350 81.7157 108.9523 114.6989 120.2693 128.7398 160.4290 178.9480 192.4724 209.0829 226.4072 241.2641 275.5717 282.8216 307.1112 315.7334 317.0236 328.7382 362.6161 390.7568 392.8460 404.6120 418.9625 439.2669 464.4490 476.4050 487.5546 495.1856 508.2275 521.3010 552.3622 570.5717 579.5072 600.2791 617.5005 634.1636 639.4412 646.6756 655.3220 700.4822 707.5292 728.4175 738.1166 739.0248 747.1506 777.1892 808.2744 825.7175 829.1722 846.6850 857.7892 864.8517 869.2718 903.3363 911.3967 938.2581 939.5517 946.3942 949.7058 969.6122 978.5949 981.8597 985.1793 990.2925 992.8369 1011.3930 1022.7847 1025.7707 1029.1455 1057.9508 1067.4825 1075.4537 1079.8393 1083.2970 1083.9966 1125.0136 1147.5944 1171.5167 1174.0872 1180.6740 1189.6267 1190.4209 1199.6711 1201.7338 1213.4339 1217.1862 1234.3151 1252.3751 1254.4439 1281.1032 1284.9568 1289.6889 1298.7493 1318.2516 1331.7438 1333.0243 1341.1487 1348.0445 1356.4771 1360.8811 1368.8536 1377.5049 1381.7463 1386.1013 1388.0078 1393.8288 1407.7277 1437.3571 1441.7024 1444.2813 1449.7147 1472.8907 1476.3999 1477.8205 1482.8929 1486.2522 1489.4876 1494.4524 1525.4477 1533.3463 1563.3667 1594.0676 1596.4440 1617.2099 1625.2916 1632.8987 2935.6925 2941.6718 2956.0456 2959.4267 2980.7615 2982.4849 2988.3550 3015.8317 3027.5616 3029.1818 3037.3391 3052.8552 3078.3976 3078.8932 3081.8018 3087.7964 3111.3012 3125.9084 3136.0234 3139.5492 3143.9306 3155.2208 3162.7563 3167.9161 3168.5070 3548.5429
redmass: 5.5340 5.4917 3.8620 4.4320 5.4285 5.1796 4.8009 5.6450 4.0655 4.5628 3.6856 4.0933 4.4066 5.5047 3.1859 4.3157 2.9524 1.1273 4.2553 2.1249 4.1641 3.2402 2.4792 3.3207 3.3145 4.7735 4.9794 5.4965 2.8002 3.0911 4.7570 3.2406 3.9182 3.6501 3.6888 3.0641 2.6631 3.6441 4.9684 3.7878 3.7144 6.2500 6.2215 3.5671 3.5485 3.1195 1.9645 1.3491 1.9312 4.3405 4.1796 5.4183 3.2082 1.3552 2.5321 2.0785 1.2495 2.4226 1.6367 2.4385 1.5769 3.3663 1.8947 2.0421 2.1267 1.7014 1.3961 2.2834 3.2880 1.5227 2.7982 1.7706 2.3422 2.3751 1.9411 2.1567 1.9175 2.9277 2.0407 2.0726 1.6231 2.0249 1.6317 1.7431 1.0637 2.6021 1.1502 1.4373 1.1518 1.4363 1.4868 1.1621 1.9703 1.5222 1.9557 1.8277 1.7206 1.6712 1.6712 1.9476 1.4180 2.2003 1.3436 1.3598 1.6697 1.7792 1.7011 1.4713 2.4869 2.7587 4.3341 2.1995 1.2982 1.6632 1.6596 1.1145 3.6222 1.3335 1.0484 1.0919 1.0954 1.0583 2.3526 1.1026 1.0831 3.3548 4.9170 6.5769 7.0070 6.8827 6.2663 6.3729 6.1890 1.0683 1.0687 1.0647 1.0635 1.0681 1.0353 1.0657 1.0961 1.0850 1.0954 1.0961 1.0923 1.0950 1.0997 1.0962 1.0999 1.0876 1.0865 1.0869 1.0924 1.0869 1.0965 1.0940 1.0997 1.0958 1.0782
irintensity: 0.4151 0.4941 1.1248 0.7201 2.1443 1.7068 2.5205 1.2545 0.5943 2.8966 1.6865 0.7880 0.8999 1.7191 4.2627 5.8903 2.8726 0.4223 2.3459 2.2712 3.8487 8.4164 2.2073 9.1227 10.9895 2.5042 0.9907 2.1673 0.4845 1.4064 6.1166 8.0089 7.3619 1.4636 8.5263 2.7886 11.6699 11.0002 55.2179 3.2337 4.6363 1.6647 0.6258 2.2606 2.1337 6.9821 42.8658 121.1293 46.9985 3.6647 12.4159 3.1864 5.9894 11.8981 24.2964 39.2798 0.4697 21.6874 6.5024 4.7504 9.1468 22.9727 2.6509 37.9163 27.9215 9.0190 0.4063 12.4906 5.0087 4.9904 1.7820 0.9914 2.0172 112.9331 21.6823 25.3116 1.2713 27.6605 5.5717 0.6254 12.2564 6.9156 25.9775 21.9559 0.8421 76.5691 7.4307 89.6047 4.8106 51.1833 156.0803 49.9548 5.5976 29.5177 17.5452 23.0712 241.2356 35.0801 14.2530 113.7020 5.5587 173.0994 1.7274 0.9726 50.0322 67.9912 76.0935 21.0633 84.3910 115.6439 37.2564 136.0119 36.1161 89.0681 5.3867 12.2833 47.0289 45.9625 9.3659 58.7641 24.3250 11.2625 18.4177 30.1202 11.3263 110.7159 70.4137 9.3104 205.3791 97.2524 49.7515 922.4266 4.2643 72.0524 53.3569 31.5699 40.9162 33.7779 25.7217 15.2308 38.9035 16.9499 38.6716 16.6746 16.8372 7.2537 15.3288 22.9253 26.5052 12.6198 0.6201 20.7881 31.8028 16.1602 41.1074 20.8828 10.6108 10.2996 36.9425
temp: 298.150 k
press: 1.00000 atm
elementType: 8 8 7 7 7 7 6 6 6 6 6 6 6 6 6 6 6 6 6 6 6 6 6 6 6 6 6 6 6 1 1 1 1 1 1 1 1 1 1 1 1 1 1 1 1 1 1 1 1 1 1 1 1 1 1
symmnumber: 1
zpe: 1182984.2 jmol-1
zpe.correction: 0.450575 hartree
zpe.thermalcorrener: 0.476781 hartree
zpe.thermalcorrenthalpy: 0.477725 hartree
zpe.thermalcorrgfe: 0.390644 hartree
zpe.sumelectzpe: -1259.392231 hartree
zpe.sumelectthermal: -1259.366025 hartree
zpe.sumelectthermalent: -1259.365081 hartree
zpe.sumelectthermalfe: -1259.452161 hartree
dipole: -3.8217 -0.1788 -0.8412
dipole: 3.9173
quadrupole: -249.8686 -163.5955 -166.7168
quadrupole: 4.7855 23.2768 3.7813
quadrupole: -56.4750 29.7981 26.6768 4.7855 23.2768 3.7813
hfenergy: -1259.8428057 hartree
pointgroup: C01 [X(C23H26N4O2)]
dipole: 1.5036778 -0.2691246 0.2043835 debye
polarizability: 553.7792329|17.2408343|213.2478082|-29.2383566|-4.837577|203.8587446 unknown
InChI: InChI=1S/C23H26N4O2/c1-17-15-21(28)24-25-23(17)19-7-9-20(10-8-19)26-11-13-27(14-12-26)22(29)16-18-5-3-2-4-6-18/h2-10,17,24H,11-16H2,1H3
charge 0 multiplicity 1
55 atoms
O  5.030299 0.678714 -1.664356
O  -9.620506 -0.163018 0.626741
N  0.199305 -0.312079 -0.68362
N  3.10788 -0.309801 -0.823104
N  -6.099778 -1.122947 0.580883
N  -7.4853 -1.055028 0.81858
C  0.942988 0.830759 -1.259907
C  0.98232 -1.517632 -0.360163
C  2.282124 0.363921 -1.851799
C  2.385545 -1.14671 0.162325
C  -1.183207 -0.240674 -0.478363
C  4.480322 -0.061884 -0.793618
C  -6.264025 1.319415 0.074578
C  -4.040451 -0.070538 -0.051246
C  -1.876174 1.006309 -0.569942
C  -1.964261 -1.404874 -0.176364
C  -5.496449 -0.001701 0.190105
C  5.263752 -0.764659 0.338358
C  -7.713282 1.045343 -0.401087
C  -3.26487 1.080535 -0.364161
C  -3.345066 -1.313705 0.034503
C  -6.240251 2.058169 1.44368
C  6.670702 -0.232726 0.560272
C  -8.379902 -0.069291 0.395473
C  7.635052 -0.241477 -0.479726
C  7.048639 0.255042 1.836035
C  8.947277 0.222548 -0.244018
C  8.362131 0.72157 2.074881
C  9.317223 0.704542 1.033776
H  0.344713 1.286379 -2.07248
H  1.12529 1.619195 -0.497986
H  0.471438 -2.080572 0.439996
H  1.075968 -2.195827 -1.235843
H  2.101226 -0.315816 -2.708472
H  2.862686 1.221736 -2.229905
H  2.278628 -0.611942 1.129188
H  2.94244 -2.082261 0.353882
H  -5.77977 1.965878 -0.678153
H  -1.326955 1.929142 -0.777209
H  -1.494838 -2.392845 -0.139076
H  5.305503 -1.845237 0.082005
H  4.692519 -0.697013 1.282738
H  -7.715474 0.735048 -1.465707
H  -8.340515 1.948793 -0.321136
H  -3.73899 2.065334 -0.436371
H  -3.92534 -2.213782 0.258568
H  -6.764862 3.028274 1.366496
H  -6.741779 1.459703 2.225615
H  -5.204145 2.247659 1.774749
H  -7.869786 -1.894085 1.257628
H  7.348822 -0.589402 -1.476987
H  6.311686 0.272223 2.649336
H  9.680654 0.213397 -1.058285
H  8.636454 1.095793 3.06772
H  10.336487 1.064507 1.214071
