program: Gaussian 09
title: 000131623
version: EM64L-G09RevD.01
frameworkgroup: C1[X(C16H15F2N3O3)]
method: RPBEPBE
basis: SDD
operation: Freq
keyword: #p
keyword: freq=noraman
keyword: PBEPBE/SDD
title: #p freq=noraman PBEPBE/SDD
converged: YES YES NO NO
title: Mulliken charges:
elementType: F F O O O N N N C C C C C C C C C C C C C C C C H H H H H H H H H H H H H H H
charge: -0.193254 -0.249214 -0.238149 -0.277410 -0.277649 -0.272431 -0.114955 -0.026452 0.362391 -0.568832 0.340845 0.157769 -0.190791 0.159812 -0.260309 -0.316993 -0.624658 -0.505005 0.201041 -0.380589 0.346766 -0.230437 -0.417286 -0.207538 0.267855 0.300035 0.277960 0.261348 0.247386 0.234947 0.277455 0.306223 0.268104 0.219018 0.252258 0.218635 0.245341 0.195063 0.211699
chargesum: 0.00000
title: Mulliken charges with hydrogens summed into heavy atoms:
elementType: F F O O O N N N C C C C C C C C C C C C C C C C
charge: -0.193254 -0.249214 -0.238149 -0.277410 -0.277649 -0.272431 -0.114955 -0.026452 0.362391 -0.000942 0.340845 0.157769 -0.190791 0.159812 0.017651 -0.055645 0.135131 -0.198782 0.201041 -0.112485 0.346766 0.240839 0.046690 0.199223
polarizability: 3.15477482e+02 1.28174827e+01 2.01112708e+02 -4.78440689e+00 5.75509235e+00 1.18698196e+02
1716.lowfreq: -7.4667 -5.9830 -0.0004 0.0009 0.0010 3.1251 18.6204 22.2926 40.8736
frequency: 18.5297 22.2532 40.8519 46.9454 60.9714 71.3068 86.2365 96.4668 109.5581 117.7303 140.1848 146.0779 175.8484 186.3843 202.2710 228.0331 253.0803 281.7978 291.0647 313.7500 322.8552 357.1962 375.2142 391.1748 400.6872 413.0664 435.6066 462.6809 488.0820 513.3968 545.3900 593.6820 613.5946 635.2208 654.0781 657.0553 686.9045 713.4422 730.1453 757.1438 767.7380 772.0080 789.2186 805.0980 825.4700 834.7815 868.1388 884.0286 903.5761 909.3732 936.3043 949.5427 953.3329 971.0179 1025.8926 1040.2794 1068.5634 1088.6243 1109.9293 1115.8057 1121.5930 1139.0008 1147.0811 1161.6651 1178.6912 1193.9939 1212.5865 1219.5011 1244.9197 1246.9022 1270.6357 1273.8005 1277.3282 1313.7394 1327.8996 1344.5961 1369.8550 1373.9220 1383.5921 1391.6617 1397.0121 1411.0757 1422.6582 1449.8116 1450.9962 1469.1335 1471.0463 1478.4406 1480.7336 1483.2549 1488.4495 1553.7771 1569.1539 1589.0370 1597.5303 1619.1244 2984.5298 2986.8948 3004.8165 3008.4690 3013.3506 3065.3101 3067.9534 3083.9527 3093.8957 3105.8072 3126.3808 3158.2221 3181.4216 3185.1650 3241.2518
redmass: 8.1459 4.5113 5.9524 6.9396 7.0193 7.0983 3.3233 5.5743 5.9334 1.1240 4.0937 3.6224 4.9380 5.6165 3.5417 5.2514 5.4872 4.5614 4.9026 4.6969 5.0082 3.9146 6.3155 5.9943 5.3324 3.9570 4.8108 5.7574 3.5944 4.1742 4.9939 3.9409 6.1716 8.4575 5.1308 5.6429 5.3421 6.4854 7.9449 4.5676 4.5082 1.4620 2.0515 3.6752 1.4862 6.1803 3.2927 2.1567 1.6495 2.9916 2.8084 1.3445 3.2950 3.2573 2.6869 4.1471 1.8865 2.7755 1.9625 2.0831 1.3043 2.4174 1.8704 2.8704 1.1550 2.8318 1.2394 2.7076 2.7138 2.2842 1.5890 1.1873 2.1706 1.5754 1.4320 3.4632 3.9927 1.4705 2.4897 3.7677 1.9516 2.8820 1.4355 1.1186 3.5647 1.1095 1.0914 1.1622 1.0893 3.0192 1.1402 9.5045 6.6077 8.2198 10.4069 7.1839 1.0406 1.0625 1.0595 1.0589 1.0619 1.0994 1.1019 1.1085 1.1065 1.0952 1.0992 1.0896 1.0927 1.0970 1.0988
irintensity: 0.6637 4.8551 0.8449 1.0262 0.8372 4.4286 2.4490 2.6420 2.2949 0.1230 2.5210 5.4673 3.8177 1.8788 3.7235 1.2061 4.1355 0.8624 0.5139 29.6903 3.7696 9.0484 0.7414 15.8365 1.7224 7.0751 0.6553 5.9355 3.4095 11.9018 8.4501 6.3973 14.7456 5.6714 14.7390 3.3536 5.3689 17.9495 9.5726 5.1037 7.1459 5.9010 13.4345 13.0720 36.0319 12.1777 25.2942 14.8505 22.0523 34.0105 9.2155 0.2903 72.5729 12.1648 68.0182 126.5314 4.7834 158.0208 10.3863 10.5579 0.4138 210.1357 47.7457 6.7455 1.1294 111.5243 3.5121 141.1591 74.3325 2.0990 21.0597 5.8011 66.0563 20.6776 15.8120 159.3392 40.6153 6.8136 9.6817 6.9698 8.3956 11.5062 70.4663 17.4015 118.4139 32.1522 5.5994 13.0207 9.8142 198.2116 0.3955 89.2014 283.4497 30.5856 200.7239 9.6640 35.8572 22.4751 1.2344 45.1433 34.3482 3.9214 21.9891 31.3535 44.6714 5.3384 1.1492 4.0601 4.7690 1.5665 0.5320
temp: 298.150 k
press: 1.00000 atm
elementType: 9 9 8 8 8 7 7 7 6 6 6 6 6 6 6 6 6 6 6 6 6 6 6 6 1 1 1 1 1 1 1 1 1 1 1 1 1 1 1
symmnumber: 1
zpe: 763733.7 jmol-1
zpe.correction: 0.290891 hartree
zpe.thermalcorrener: 0.312783 hartree
zpe.thermalcorrenthalpy: 0.313728 hartree
zpe.thermalcorrgfe: 0.237136 hartree
zpe.sumelectzpe: -1206.587087 hartree
zpe.sumelectthermal: -1206.565195 hartree
zpe.sumelectthermalent: -1206.564251 hartree
zpe.sumelectthermalfe: -1206.640843 hartree
dipole: 0.6788 -1.8622 -0.0416
dipole: 1.9825
quadrupole: -153.6825 -131.4147 -141.3613
quadrupole: 13.5800 -22.5884 2.5841
quadrupole: -11.5297 10.7381 0.7915 13.5800 -22.5884 2.5841
hfenergy: -1206.8779782 hartree
pointgroup: C01 [X(C16H15F2N3O3)]
dipole: 0.2621053 -0.7345638 -0.0089816 debye
polarizability: 315.6515154|11.9953329|201.0506025|-4.7296693|4.9890479|118.586268 unknown
InChI: InChI=1S/C16H15F2N3O3/c1-20-8-13-14(16(23)24-6-2-5-17)19-9-21(13)12-4-3-10(18)7-11(12)15(20)22/h3-4,7,9H,2,5-6,8H2,1H3
charge 0 multiplicity 1
39 atoms
F  -6.475963 -0.880814 0.496869
F  7.748208 -0.254114 1.082482
O  3.671781 -0.505642 -0.251094
O  -3.174656 2.53857 -1.128339
O  2.666344 1.33011 0.776858
N  -0.890242 -0.910731 -0.200423
N  -1.229209 2.1200 0.083248
N  1.16251 -1.673298 -0.809564
C  0.032273 0.025713 0.280628
C  -0.450714 1.247714 0.998258
C  -2.310169 -0.851308 -0.006375
C  -3.027853 0.383088 -0.058397
C  1.294553 -0.458712 -0.102211
C  -2.470056 1.754717 -0.414084
C  -0.151587 -1.91765 -0.853063
C  -2.995874 -2.07265 0.219373
C  -0.633334 3.413231 -0.305518
C  -4.436588 0.347422 0.104113
C  2.57158 0.21444 0.189053
C  -4.391355 -2.096946 0.388344
C  -5.081881 -0.873181 0.328007
C  4.999935 0.114409 0.018736
C  6.035739 -0.854315 -0.553942
C  7.463361 -0.351849 -0.357105
H  -1.073483 0.969204 1.871246
H  0.424622 1.80768 1.359008
H  -0.622522 -2.75475 -1.361734
H  -2.426462 -3.004561 0.285136
H  0.366891 3.253614 -0.746563
H  -0.533135 4.075443 0.574164
H  -1.297012 3.890446 -1.041859
H  -5.004389 1.277199 0.013221
H  -4.93164 -3.029751 0.570014
H  5.03567 1.107792 -0.466967
H  5.121507 0.254402 1.106788
H  5.853474 -0.991611 -1.637509
H  5.919511 -1.84334 -0.076151
H  7.61716 0.66146 -0.773805
H  8.203503 -1.055032 -0.777742
