program: Gaussian 09
title: 000131620
version: EM64L-G09RevD.01
frameworkgroup: C1[X(C21H25FN4O3)]
method: RPBEPBE
basis: SDD
operation: Freq
keyword: #p
keyword: freq=noraman
keyword: PBEPBE/SDD
title: #p freq=noraman PBEPBE/SDD
converged: YES YES NO NO
title: Mulliken charges:
elementType: F O O O N N N N C C C C C C C C C C C C C C C C C C C C C H H H H H H H H H H H H H H H H H H H H H H H H H
charge: -0.196379 -0.216705 -0.252786 -0.218264 -0.072435 -0.239297 -0.227074 0.010277 -0.196891 -0.445523 -0.438454 -0.398985 -0.386003 -0.353121 -0.353007 0.094146 -0.346042 -0.405567 -0.417252 -0.472420 0.124287 0.284341 0.313925 0.018087 -0.316097 -0.330972 -0.399062 -0.372537 0.332050 0.228876 0.209784 0.208093 0.218217 0.220504 0.241731 0.213187 0.221363 0.190548 0.205726 0.245882 0.253483 0.246370 0.269014 0.244023 0.216501 0.224492 0.234813 0.214890 0.246121 0.269163 0.248286 0.284693 0.260247 0.261753
chargesum: 0.00000
title: Mulliken charges with hydrogens summed into heavy atoms:
elementType: F O O O N N N N C C C C C C C C C C C C C C C C C C C C C
charge: -0.196379 -0.216705 -0.252786 -0.218264 -0.072435 -0.239297 -0.227074 0.010277 0.031985 -0.027647 0.000267 0.055933 0.025908 0.098487 0.146845 0.094146 0.166995 0.035426 0.032451 0.042864 0.124287 0.284341 0.313925 0.018087 -0.067811 -0.046279 -0.138815 -0.110784 0.332050
polarizability: 3.63212725e+02 3.16049299e+01 2.36448719e+02 -3.94947368e+00 7.06921725e+00 1.93469435e+02
1716.lowfreq: -1.0647 -0.0009 -0.0005 0.0009 1.4194 8.0508 10.9048 15.2765 20.0012
frequency: 10.2380 14.8192 19.9547 29.4908 39.4994 59.4182 62.7939 78.9682 91.6751 95.2594 100.7087 113.5080 136.0009 179.0618 186.6977 236.0390 242.0136 260.3638 264.7959 275.6906 298.9091 308.5559 314.8669 332.1539 356.1874 369.3724 374.9796 382.3788 399.2431 411.5666 427.7967 429.3081 449.2947 461.7833 489.2688 499.8090 518.3438 522.6260 559.7276 584.9016 606.8587 617.4121 624.7441 665.3685 671.0537 695.6886 715.4433 733.0069 750.0036 762.3642 777.3916 789.3768 806.9736 809.8437 819.2798 823.3229 837.6252 846.8343 861.6285 897.0176 905.2252 913.2343 918.0153 954.1506 969.3934 976.2963 989.4543 995.5724 1004.9956 1015.1830 1018.3177 1041.9609 1056.5791 1064.0378 1073.4703 1086.7960 1089.0507 1099.3012 1106.9675 1113.1303 1136.8851 1137.8622 1148.6103 1157.7243 1164.1774 1177.0585 1185.9434 1190.0180 1204.5412 1217.0161 1224.0303 1241.2394 1254.4602 1266.5115 1272.9318 1281.0153 1295.1564 1301.0900 1303.0574 1314.8143 1326.1630 1329.7794 1335.1692 1337.6359 1342.0770 1347.5404 1351.9708 1354.6381 1365.1774 1375.7273 1380.2839 1395.9933 1403.0860 1409.4924 1441.3379 1444.7744 1450.4007 1453.8001 1469.6251 1469.6947 1475.6486 1481.5999 1487.6550 1489.4779 1492.4964 1558.9594 1565.0493 1598.5856 1604.9848 1610.5158 1647.1971 2851.1602 2892.2208 2917.7464 2972.1190 2990.1301 2993.1494 2995.0435 2996.1801 3000.9696 3001.3815 3031.8593 3036.7892 3046.3186 3056.3541 3058.9133 3060.7383 3061.9360 3064.6106 3079.6517 3084.4125 3127.6731 3153.8019 3157.1851 3177.1951 3180.2417
redmass: 5.7464 7.1640 4.4680 5.9533 5.3447 4.2087 3.7116 3.5672 3.2731 7.4079 7.7253 4.9508 5.8045 3.2202 4.5999 4.5623 3.5383 3.7012 3.7632 3.8946 3.7725 1.8090 2.8937 3.2184 3.0905 2.7756 5.0311 6.0750 3.6044 2.9720 4.2733 5.2537 3.0875 4.7727 4.0515 3.1862 4.1144 2.9453 3.2793 5.4617 3.9234 5.0314 7.0514 4.3134 4.9421 3.4643 10.0733 4.0380 4.1683 4.0666 1.7063 3.2936 1.7065 2.2044 1.5004 1.4947 4.0634 2.2826 2.2917 2.6928 2.7678 1.4069 2.6978 1.3625 3.3364 2.4836 1.3520 2.5559 2.4568 2.0589 1.9044 3.7611 4.4650 2.3896 1.9892 1.9973 2.9876 1.8906 1.3706 1.6838 2.4033 2.2421 1.6972 1.4690 1.6412 1.6998 1.1704 3.0330 2.1162 2.5539 2.0441 1.4032 1.2677 1.5093 1.2419 1.9560 1.2945 1.4543 1.3925 1.7830 1.3938 1.3751 1.8088 1.5865 1.3646 1.5186 1.5177 1.4092 1.5563 2.0530 2.1788 1.3939 2.0672 4.0103 1.0949 1.0894 1.1167 1.0949 1.0868 1.0824 1.0995 1.0823 1.1707 2.2487 1.1436 9.6239 8.4356 7.2065 11.8456 7.0380 10.6135 1.0709 1.0699 1.0683 1.0779 1.0699 1.0660 1.0602 1.0618 1.0641 1.0658 1.0885 1.0907 1.0888 1.0598 1.1027 1.0972 1.1021 1.0997 1.0947 1.0995 1.1069 1.0889 1.0889 1.0962 1.0973
irintensity: 1.3706 0.5132 0.9590 0.3444 0.9728 0.9697 0.0199 1.0858 2.3636 0.4429 2.7732 3.5198 6.8845 3.9068 0.4679 0.9248 0.8613 0.5257 0.6083 0.8419 10.1851 3.5949 2.0450 1.0526 7.7436 8.6075 0.6675 15.3431 8.6289 0.2198 1.9882 2.6239 0.1377 2.0693 3.1217 8.2751 6.6200 22.2157 1.2117 4.2250 19.5707 1.3979 0.4563 11.4131 5.1284 2.9593 0.8357 1.4908 25.3112 10.2334 1.0559 8.8051 16.0790 24.1449 7.4081 3.0123 0.4999 32.9202 21.5561 10.6993 5.4662 2.5619 6.8547 0.6522 141.3620 8.5382 1.4402 3.9699 2.4884 6.4036 5.2101 1.0485 25.6805 3.1635 29.0967 12.4681 2.2221 0.8724 17.4398 27.5584 3.9540 48.9882 17.4468 97.1898 12.6699 21.8088 35.9556 40.4649 19.0314 164.0551 90.7257 8.6395 10.3936 32.0258 5.1679 88.2481 7.0807 15.1825 8.6863 101.3526 11.6598 11.3831 34.7379 18.6163 12.5686 9.4806 1.2135 45.2021 5.6619 5.2196 35.5395 0.8440 82.9910 13.2886 34.8177 10.2154 4.2916 6.3812 20.3553 1.6819 19.9588 9.8836 14.6120 43.6387 33.0386 276.7940 113.3766 52.2814 803.9407 60.5908 92.8452 89.9380 64.7222 40.2069 25.2678 8.5994 25.9000 22.1975 29.2040 19.2553 58.9436 40.8719 30.0778 12.9469 16.5874 29.7905 41.6025 39.7093 34.3596 6.0459 16.8421 1.6839 8.3300 0.0683 3.7629 4.6315
temp: 298.150 k
press: 1.00000 atm
elementType: 9 8 8 8 7 7 7 7 6 6 6 6 6 6 6 6 6 6 6 6 6 6 6 6 6 6 6 6 6 1 1 1 1 1 1 1 1 1 1 1 1 1 1 1 1 1 1 1 1 1 1 1 1 1
symmnumber: 1
zpe: 1146913.1 jmol-1
zpe.correction: 0.436836 hartree
zpe.thermalcorrener: 0.462747 hartree
zpe.thermalcorrenthalpy: 0.463691 hartree
zpe.thermalcorrgfe: 0.376725 hartree
zpe.sumelectzpe: -1357.639310 hartree
zpe.sumelectthermal: -1357.613399 hartree
zpe.sumelectthermalent: -1357.612455 hartree
zpe.sumelectthermalfe: -1357.699421 hartree
dipole: -3.7012 -2.4603 0.0231
dipole: 4.4444
quadrupole: -127.5870 -189.6942 -164.0569
quadrupole: 26.4612 14.5635 8.2636
quadrupole: 32.8590 -29.2482 -3.6109 26.4612 14.5635 8.2636
hfenergy: -1358.0761462 hartree
pointgroup: C01 [X(C21H25F1N4O3)]
dipole: 1.4288235 -0.6899651 -0.7347742 debye
polarizability: 361.4383525|-22.1378266|221.4480023|-27.1789698|22.9518003|210.2445239 unknown
InChI: InChI=1S/C21H25FN4O3/c22-17-6-4-15(5-7-17)19(27)16-8-11-24(12-9-16)13-14-26-20(28)23-18-3-1-2-10-25(18)21(26)29/h4-7,16H,1-3,8-14H2
charge 0 multiplicity 1
54 atoms
F  -9.203139 -0.522075 1.571506
O  -3.509637 -1.355478 -1.228107
O  3.542806 -0.513307 -1.874143
O  3.219024 1.879544 2.145915
N  -0.422509 0.893528 -0.121487
N  3.369566 0.736413 0.109931
N  5.312846 -0.576677 -0.331648
N  5.165732 0.628898 1.738595
C  -3.269183 1.06879 -0.961946
C  -2.095952 1.006271 -1.973523
C  -2.743009 1.572155 0.424632
C  -0.843072 0.297527 -1.418038
C  -1.501816 0.785198 0.888339
C  0.889256 0.397513 0.343461
C  2.027407 1.244656 -0.278795
C  -4.014568 -0.266894 -0.818086
C  6.004576 -1.535333 -1.251614
C  7.505992 -1.640965 -0.953069
C  7.734762 -1.856346 0.556178
C  7.200694 -0.634246 1.32821
C  5.816367 -0.173253 0.906811
C  4.023323 -0.135485 -0.771281
C  -5.378781 -0.280193 -0.17206
C  3.894286 1.129685 1.397884
C  -6.081914 0.900883 0.194372
C  -5.991418 -1.543514 0.060021
C  -7.364066 0.828674 0.776621
C  -7.267871 -1.63804 0.643857
C  -7.925741 -0.442633 0.989244
H  -4.004159 1.813437 -1.33053
H  -1.822014 2.044307 -2.242712
H  -2.419801 0.485864 -2.893649
H  -3.531978 1.510074 1.19694
H  -2.454754 2.634742 0.314348
H  -1.053671 -0.791561 -1.308699
H  -0.015635 0.405035 -2.142921
H  -1.136288 1.213498 1.839528
H  -1.781965 -0.281728 1.086778
H  1.048984 -0.678543 0.091471
H  0.946721 0.499012 1.441851
H  1.941734 2.280052 0.085182
H  1.971413 1.224517 -1.378134
H  5.808162 -1.192984 -2.280577
H  5.514544 -2.521979 -1.143189
H  8.026646 -0.721137 -1.283101
H  7.916346 -2.479109 -1.544761
H  8.807443 -1.995647 0.77845
H  7.213747 -2.77702 0.884481
H  7.880459 0.229041 1.181108
H  7.162578 -0.806503 2.416653
H  -5.641373 1.887278 0.022057
H  -5.439588 -2.441694 -0.234746
H  -7.920371 1.726364 1.060337
H  -7.750241 -2.601914 0.829154
