program: Gaussian 09
title: 000131614
version: EM64L-G09RevD.01
frameworkgroup: C1[X(C12H9Cl2N5O)]
method: RPBEPBE
basis: SDD
operation: Freq
keyword: #p
keyword: freq=noraman
keyword: PBEPBE/SDD
title: #p freq=noraman PBEPBE/SDD
converged: YES YES NO NO
title: Mulliken charges:
elementType: Cl Cl O N N N N N C C C C C C C C C C C C H H H H H H H H H
charge: -0.017500 -0.006892 -0.249903 -0.362657 -0.388188 -0.364682 -0.085547 -0.090709 -0.556637 0.230498 0.095941 0.515401 0.078456 0.005699 -0.411961 -0.362908 -0.216088 -0.060161 -0.205286 -0.102632 0.232358 0.277458 0.292662 0.323110 0.340749 0.258479 0.299207 0.269930 0.261802
chargesum: 0.00000
title: Mulliken charges with hydrogens summed into heavy atoms:
elementType: Cl Cl O N N N N N C C C C C C C C C C C C
charge: -0.017500 -0.006892 -0.249903 -0.069995 -0.065078 -0.023933 -0.085547 -0.090709 -0.046821 0.230498 0.095941 0.515401 0.078456 0.005699 -0.153482 -0.063701 0.053842 -0.060161 0.056516 -0.102632
polarizability: 2.73718645e+02 -2.12165333e+01 1.72004793e+02 2.21964532e+00 1.07667662e+01 1.21305735e+02
1716.lowfreq: -8.0608 -3.5012 -0.9083 -0.0017 -0.0016 -0.0015 12.1720 26.3643 28.7710
frequency: 12.1686 26.3607 28.7389 74.6413 110.5399 125.2475 147.1198 167.9042 181.7339 202.4380 223.7940 249.6761 282.9008 302.4000 321.9961 361.7725 384.1530 404.2332 435.1373 438.2445 468.6810 487.2396 512.4733 556.4026 579.7335 611.7181 614.2799 644.8202 665.9921 672.8092 687.8011 697.4059 698.6586 720.7422 765.0786 795.6779 804.8071 837.1979 850.5501 887.5810 921.9020 927.7503 973.6624 988.1072 1003.4303 1061.6753 1084.3530 1118.1361 1124.6052 1146.3274 1157.1823 1209.7682 1235.7534 1243.6139 1254.7885 1265.7346 1328.6116 1334.7677 1358.4619 1371.2443 1384.2605 1390.0204 1409.3110 1448.7095 1461.4118 1501.8069 1518.5686 1536.9387 1570.0780 1594.9291 1606.3479 1618.4286 3017.0271 3086.7997 3143.5977 3147.8980 3171.4239 3252.1658 3546.3993 3558.0686 3586.4369
redmass: 8.9853 10.3385 8.6054 7.3643 6.2419 9.0819 7.2870 6.2846 19.6262 8.5144 4.3529 4.9019 6.6168 6.3091 2.9930 3.8313 1.8116 5.6607 5.2711 3.6233 4.4121 5.9144 6.8262 1.2214 5.9012 4.0738 7.4715 6.2150 5.2445 6.1968 6.6680 5.4619 1.3217 3.5772 6.8153 5.8170 1.5483 2.1689 1.9939 1.5958 6.4697 4.6771 2.2531 1.4594 5.2622 3.2357 1.8980 2.2447 3.5849 1.5655 2.5051 2.3651 1.7232 1.8508 1.6583 1.8250 2.9650 3.6072 1.3936 7.4725 3.0554 2.4400 2.8034 1.3044 2.0278 2.2539 3.7356 3.8759 7.5215 6.4764 7.2663 9.8729 1.0619 1.1015 1.0922 1.0909 1.0962 1.0993 1.0785 1.0774 1.0825
irintensity: 1.0154 3.2407 1.6467 2.1276 0.8072 1.2591 0.9276 0.6885 0.0269 3.6350 7.1491 2.8295 19.7607 4.3260 7.9983 0.5733 54.9906 11.6902 19.1612 8.0940 13.7483 6.9523 2.7363 177.9604 12.8854 14.9129 5.9036 8.7926 13.1282 4.3345 22.8235 26.1299 114.3933 13.4662 1.1339 5.5304 20.7763 39.2533 23.3928 18.5795 23.0550 5.9530 8.2614 9.9110 25.3291 48.4200 7.9763 60.0957 45.6559 2.5953 18.7959 25.3057 51.9929 25.5932 50.5647 86.6474 21.8732 112.0501 13.5004 9.7746 81.9227 31.9565 55.3229 54.6820 37.2160 91.7935 154.4766 329.6693 19.3703 9.5200 484.1795 382.8283 43.0448 3.3758 2.5125 2.6823 2.1629 1.4701 41.3942 48.2217 89.5668
temp: 298.150 k
press: 1.00000 atm
elementType: 17 17 8 7 7 7 7 7 6 6 6 6 6 6 6 6 6 6 6 6 1 1 1 1 1 1 1 1 1
symmnumber: 1
zpe: 530551.9 jmol-1
zpe.correction: 0.202077 hartree
zpe.thermalcorrener: 0.219137 hartree
zpe.thermalcorrenthalpy: 0.220082 hartree
zpe.thermalcorrgfe: 0.154040 hartree
zpe.sumelectzpe: -1730.389199 hartree
zpe.sumelectthermal: -1730.372138 hartree
zpe.sumelectthermalent: -1730.371194 hartree
zpe.sumelectthermalfe: -1730.437236 hartree
dipole: -3.4239 -3.5661 -2.4301
dipole: 5.5087
quadrupole: -126.6039 -119.4883 -139.2243
quadrupole: -6.2195 10.7404 -7.4258
quadrupole: 1.8349 8.9506 -10.7855 -6.2195 10.7404 -7.4258
hfenergy: -1730.5912759 hartree
pointgroup: C01 [X(C12H9Cl2N5O1)]
dipole: -1.3110454 -1.3912461 1.0211787 debye
polarizability: 274.553827|-3.7404886|133.8471911|18.9279314|-24.1073418|158.6281559 unknown
InChI: InChI=1S/C12H9Cl2N5O/c13-7-2-1-6(3-8(7)14)4-15-12-18-10-9(11(20)19-12)16-5-17-10/h1-3,5,15-16,18H,4H2
charge 0 multiplicity 1
29 atoms
Cl 6.081347 -0.716548 0.682334
Cl 5.599508 -0.147253 -2.525228
O  -2.703485 2.285396 -1.424486
N  -0.022218 -0.322186 1.454988
N  -2.096173 -1.214664 0.754661
N  -4.725883 -0.081319 -1.320249
N  -1.349857 0.965004 -0.000796
N  -4.317974 -1.962775 -0.100299
C  1.022908 0.720592 1.52346
C  -1.171393 -0.1562 0.701743
C  -3.266452 -1.064558 0.016583
C  2.164002 0.50834 0.531786
C  -3.477866 0.110396 -0.71862
C  -2.522955 1.216763 -0.764381
C  3.430006 0.061802 0.977644
C  1.96668 0.759882 -0.851487
C  -5.191352 -1.325919 -0.926011
C  4.478848 -0.142826 0.056464
C  3.015854 0.556482 -1.769742
C  4.27413 0.101865 -1.316664
H  1.410674 0.745776 2.558091
H  0.512701 1.675533 1.313708
H  0.203469 -1.246959 1.823386
H  -1.967669 -2.041841 1.340146
H  -5.180623 0.596263 -1.932502
H  3.614823 -0.12394 2.041461
H  0.991414 1.121986 -1.194065
H  -6.145654 -1.7365 -1.244651
H  2.871793 0.754709 -2.835874
