program: Gaussian 09
title: 000131611
version: EM64L-G09RevD.01
frameworkgroup: C1[X(C16H30F2O2)]
method: RPBEPBE
basis: SDD
operation: Freq
keyword: #p
keyword: freq=noraman
keyword: PBEPBE/SDD
title: #p freq=noraman PBEPBE/SDD
converged: YES YES NO NO
title: Mulliken charges:
elementType: F F O O C C C C C C C C C C C C C C C C H H H H H H H H H H H H H H H H H H H H H H H H H H H H H H
charge: -0.233417 -0.233781 -0.417804 -0.230999 -0.008716 -0.445708 -0.008935 -0.382698 -0.444226 -0.381539 -0.379533 -0.384687 -0.369492 -0.369366 -0.353721 -0.375681 -0.356441 -0.488385 -0.696222 0.171053 0.190157 0.206027 0.251964 0.189581 0.229546 0.184821 0.251695 0.205491 0.188337 0.201330 0.227256 0.182180 0.195094 0.200049 0.184356 0.197526 0.193583 0.190498 0.191535 0.186252 0.218109 0.218161 0.193977 0.196828 0.253147 0.251734 0.210782 0.209098 0.215923 0.375263
chargesum: 0.00000
title: Mulliken charges with hydrogens summed into heavy atoms:
elementType: F F O O C C C C C C C C C C C C C C C C
charge: -0.233417 -0.233781 -0.042542 -0.230999 0.181440 0.012283 0.180647 0.031668 0.012960 0.008128 0.029903 0.010456 0.012390 0.014715 0.024066 0.060589 0.034364 0.016496 -0.060419 0.171053
polarizability: 2.46897199e+02 7.16567494e-01 1.58467319e+02 -8.03340387e-01 -2.31802887e+00 1.41261629e+02
1716.lowfreq: -38.9252 -4.7041 -0.0017 0.0003 0.0013 3.1235 8.4444 12.8595 18.2466
frequency: -24.8807 8.3186 13.7519 18.5023 28.1677 42.9777 44.2539 54.7502 65.7468 81.3305 92.7050 98.2871 103.1735 118.2571 123.4227 135.1992 136.9948 142.4451 152.6334 184.0946 215.1129 229.7782 253.5233 266.5824 295.6786 324.4531 381.0845 393.8600 420.1937 444.4581 479.9837 499.9196 509.1695 533.2862 588.5929 639.2037 696.6476 719.4657 723.9780 727.8235 736.0983 750.4627 769.9303 788.3424 813.2246 848.0537 856.7851 884.1031 889.1996 913.2772 972.8771 983.8790 989.9011 994.8032 1008.4208 1015.3063 1038.7165 1039.7003 1048.0866 1064.5350 1069.8800 1080.9402 1081.6521 1083.0740 1086.4656 1104.7715 1115.8847 1125.8992 1139.2591 1167.8580 1196.5526 1205.2087 1209.9679 1223.8356 1236.7693 1244.8701 1247.9979 1256.5128 1269.2410 1277.1133 1280.8232 1283.1582 1288.2874 1289.5888 1294.1238 1296.0073 1296.9127 1307.9570 1312.5509 1317.8864 1325.4631 1345.5011 1351.5409 1358.0964 1358.9565 1371.8693 1373.3737 1375.2579 1389.2506 1436.1392 1446.0947 1446.8877 1460.0393 1461.0419 1463.2678 1465.0440 1468.0106 1473.6369 1477.3245 1478.3393 1482.1807 1485.6773 1488.1606 1669.3470 2949.8406 2950.7922 2950.9455 2954.2014 2958.4382 2962.0460 2964.4096 2967.7108 2971.7247 2980.5168 2981.8936 2984.6135 2984.9751 2986.6421 2988.8411 2994.1083 2998.2811 2998.4439 3004.6437 3020.5046 3025.2183 3029.7702 3038.6356 3039.4028 3060.4799 3064.6743 3067.0580 3068.4040 3071.1771 3510.4801
redmass: 1.7496 5.2962 6.9690 5.4514 4.5061 3.6189 2.1152 3.6523 3.7891 2.2672 3.0741 2.9255 2.8869 1.9216 4.5387 2.3245 2.2088 3.5890 2.1565 5.2977 5.0394 1.1167 6.2805 3.7335 4.7873 3.3651 3.5916 3.8810 2.8803 3.5651 3.3662 1.8006 2.9112 3.0495 4.6679 1.3099 4.3615 1.0724 1.0674 1.1407 1.1946 1.4104 1.7419 1.7687 1.5615 1.6395 4.8426 1.3808 1.8824 1.5850 1.3639 2.2174 3.8095 2.1444 3.4850 3.6979 2.8213 1.9858 1.8295 2.8020 2.6311 2.3610 2.3564 2.0854 2.0684 3.1760 1.4974 3.0459 1.7657 2.0187 1.5807 1.3073 1.4279 1.2738 1.3624 1.3232 1.3320 1.3379 1.3119 1.1940 1.1289 1.0513 1.1231 1.2923 1.1044 1.1185 1.1251 1.3173 1.2430 1.2029 1.4190 1.4777 1.5582 1.6644 1.6562 1.8176 1.7005 1.6821 1.2187 1.0844 1.0806 1.0845 1.0753 1.0651 1.0667 1.0766 1.0866 1.0714 1.0431 1.0974 1.0807 1.1002 1.0900 8.2214 1.0590 1.0592 1.0589 1.0597 1.0609 1.0633 1.0626 1.0601 1.0363 1.0755 1.0693 1.0733 1.0614 1.0947 1.0955 1.0594 1.0911 1.0913 1.0990 1.0998 1.1003 1.0990 1.1009 1.1007 1.1031 1.0991 1.0990 1.1005 1.0993 1.0639
irintensity: 0.1625 0.0675 2.1366 0.1108 0.2582 0.4724 0.5789 0.3235 0.4547 0.2127 0.1244 1.4684 0.7450 0.2057 0.3691 0.1377 0.2061 3.1514 0.7810 1.1616 1.0148 0.0046 0.3903 1.6012 15.8964 1.6753 4.0107 3.9370 0.5342 2.5437 8.2298 27.1259 26.1209 4.1458 14.5631 129.1851 19.8716 18.1864 11.6735 0.8668 1.8387 1.2809 6.7121 25.2534 9.9948 11.2157 1.4207 2.4375 3.2731 15.1623 0.7329 5.8589 44.3415 2.7122 24.2319 74.3360 110.2342 5.6149 0.4700 14.9259 31.4681 0.9106 32.3229 0.4852 6.0635 2.0802 1.3108 20.0881 4.0771 4.1055 2.2844 37.9006 13.4256 2.0626 0.2353 1.3221 0.4735 2.6069 2.4397 0.9827 0.6676 0.4346 0.3616 8.2074 1.7673 1.5183 0.0527 6.2726 14.7384 6.4742 13.0605 2.0837 5.0401 2.2057 1.3446 35.6304 0.6676 2.2646 10.7705 27.4850 11.9915 0.3921 0.1028 0.9559 0.0859 0.4112 2.0736 1.8819 12.2246 0.8375 2.5514 26.8674 24.5539 208.2374 2.1310 1.5397 5.9702 6.4231 13.9697 12.4539 87.9820 116.7897 38.9293 3.4122 0.8925 40.6436 5.8423 8.7486 7.7490 39.4158 28.2764 22.3592 2.8984 14.2448 12.3979 0.4352 44.6552 69.4519 67.8432 7.5002 43.9154 158.6300 54.1559 18.0843
temp: 298.150 k
press: 1.00000 atm
elementType: 9 9 8 8 6 6 6 6 6 6 6 6 6 6 6 6 6 6 6 6 1 1 1 1 1 1 1 1 1 1 1 1 1 1 1 1 1 1 1 1 1 1 1 1 1 1 1 1 1 1
symmnumber: 1
zpe: 1141021.7 jmol-1
zpe.correction: 0.434592 hartree
zpe.thermalcorrener: 0.459339 hartree
zpe.thermalcorrenthalpy: 0.460283 hartree
zpe.thermalcorrgfe: 0.373485 hartree
zpe.sumelectzpe: -976.211664 hartree
zpe.sumelectthermal: -976.186917 hartree
zpe.sumelectthermalent: -976.185973 hartree
zpe.sumelectthermalfe: -976.272771 hartree
dipole: 0.4867 -1.0260 -2.3597
dipole: 2.6187
quadrupole: -119.6521 -133.6867 -121.9620
quadrupole: 14.5960 -8.0392 0.7891
quadrupole: 5.4482 -8.5864 3.1383 14.5960 -8.0392 0.7891
hfenergy: -976.6462558 hartree
pointgroup: C01 [X(C16H30F2O2)]
dipole: -0.1984798 -0.5217398 0.8659338 debye
polarizability: 246.9048745|-0.6328807|157.5704772|-0.0388648|4.4668166|142.1507948 unknown
InChI: InChI=1S/C16H30F2O2/c1-2-3-4-8-11-14(17)15(18)12-9-6-5-7-10-13-16(19)20/h14-15,19H,2-13H2,1H3
charge 0 multiplicity 1
50 atoms
F  -1.551088 1.377221 -0.757149
F  -2.785352 -1.43985 -0.760763
O  9.850441 -0.638692 -0.204041
O  8.868709 1.308566 0.59076
C  -1.520983 0.36247 0.316507
C  -0.263467 -0.48808 0.128049
C  -2.840183 -0.417301 0.30453
C  1.039555 0.316538 0.321174
C  -4.092387 0.432873 0.082917
C  2.305073 -0.519748 0.030977
C  -5.401787 -0.366428 0.25438
C  3.614555 0.266452 0.262477
C  -6.658085 0.476245 -0.057727
C  4.884535 -0.555557 -0.051424
C  -7.977694 -0.300857 0.146957
C  6.186849 0.234429 0.202403
C  -9.236204 0.53379 -0.183039
C  7.443347 -0.594789 -0.122946
C  -10.550865 -0.246461 0.033067
C  8.737056 0.151298 0.13656
H  -1.474733 0.943434 1.261617
H  -0.298411 -1.330936 0.84886
H  -0.296576 -0.935857 -0.881645
H  -2.907711 -0.991438 1.252538
H  1.019296 1.199833 -0.346305
H  1.08675 0.705407 1.360439
H  -4.037385 0.873886 -0.928782
H  -4.071136 1.280971 0.798225
H  2.304735 -1.428322 0.66979
H  2.271598 -0.878135 -1.018883
H  -5.374479 -1.250515 -0.411859
H  -5.468584 -0.754082 1.293108
H  3.65336 0.612156 1.316634
H  3.607186 1.182349 -0.36419
H  -6.664851 1.383845 0.582548
H  -6.60364 0.836838 -1.105978
H  4.850875 -0.888447 -1.110115
H  4.884038 -1.478875 0.565626
H  -7.968595 -1.213208 -0.485452
H  -8.038413 -0.652906 1.198332
H  6.227627 0.563804 1.258354
H  6.189943 1.159592 -0.405439
H  -9.241007 1.449177 0.443764
H  -9.177968 0.878874 -1.235566
H  7.445668 -0.919163 -1.182217
H  7.468658 -1.529469 0.471971
H  -10.585108 -1.149973 -0.604739
H  -10.64781 -0.575939 1.084946
H  -11.434446 0.372039 -0.210025
H  10.682194 -0.122457 -0.020722
