program: Gaussian 09
title: 000131608
version: EM64L-G09RevD.01
frameworkgroup: C1[X(C15H14N4)]
method: RPBEPBE
basis: SDD
operation: Freq
keyword: #pfreq=noraman
keyword: PBEPBE/SDD
title: #p freq=noraman PBEPBE/SDD
converged: YES YES NO NO
title: Mulliken charges:
elementType: N N N N C C C C C C C C C C C C C C C H H H H H H H H H H H H H H
charge: -0.062083 -0.407083 0.001249 -0.026787 -0.559574 0.465147 -0.471136 -0.368065 -0.439403 0.173800 0.292729 -0.235516 -0.221811 -0.243530 -0.257233 -0.436196 -0.190843 -0.324704 -0.127632 0.231209 0.200392 0.233631 0.218331 0.266852 0.227592 0.225753 0.223753 0.227307 0.263069 0.272426 0.362160 0.238546 0.247648
chargesum: 0.00000
title: Mulliken charges with hydrogens summed into heavy atoms:
elementType: N N N N C C C C C C C C C C C C C C C
charge: -0.062083 -0.044923 0.001249 -0.026787 -0.127972 0.465147 -0.019175 -0.101213 -0.211811 0.173800 0.292729 -0.009763 0.001942 -0.016223 0.005836 -0.163769 0.047704 -0.077056 -0.127632
polarizability: 2.39985469e+02 1.63621750e+01 1.88009876e+02 7.55546783e+00 2.71677169e+00 1.31809947e+02
1716.lowfreq: -0.0004 0.0002 0.0005 3.5804 4.5393 9.3387 16.2896 18.7589 39.6867
frequency: 16.0391 18.4715 39.5297 50.5667 82.0275 92.9025 97.4708 139.7739 156.4991 206.9319 220.3482 275.5339 317.1995 328.2501 365.9143 397.6598 404.5951 409.1259 461.8022 476.4525 488.4640 529.6762 559.2385 587.4805 616.4391 617.8448 654.7961 683.8904 706.1557 719.2621 746.6909 756.3782 769.0637 818.9976 855.3494 864.0612 914.9164 931.3666 945.2322 952.9076 976.7602 984.4134 990.1211 990.3603 995.0110 997.6519 1020.1071 1028.0137 1049.8635 1060.7771 1084.2486 1122.7640 1146.7847 1171.0543 1179.8132 1187.9371 1205.8652 1214.0229 1242.4153 1291.9831 1312.8814 1326.3121 1333.5213 1335.3478 1354.1717 1383.0556 1409.5548 1427.7801 1435.1397 1441.1910 1456.4782 1461.3063 1484.0695 1549.2918 1583.9306 1592.2441 1613.9985 1628.9990 2195.6825 2895.6186 2949.0655 3000.8612 3057.2188 3110.8508 3124.7551 3137.8646 3138.3109 3152.9718 3153.1137 3153.8176 3164.8238 3175.7931 3510.9339
redmass: 5.8541 4.7181 4.6180 5.4583 5.9545 4.4844 6.3056 5.3869 3.4486 6.2111 3.9265 3.8695 2.5287 6.3571 3.4230 2.8691 2.8278 2.9326 2.8301 6.2597 4.1218 1.9296 3.2421 5.3916 7.4475 6.4353 5.2155 5.9362 1.7550 1.8910 4.4969 3.5062 1.9848 1.7551 1.2496 2.8898 1.3848 1.3719 2.2924 1.5200 1.4069 3.1986 2.8646 1.8027 1.5292 2.5687 5.3623 2.1679 3.1059 2.5130 1.5986 1.8091 2.9324 1.0648 1.1639 1.1167 1.2960 2.2814 1.1988 3.9884 8.0494 1.2788 1.2774 1.3798 1.4220 6.5085 2.2045 1.2518 1.2105 1.9990 2.1616 1.1398 2.3075 5.3119 5.8378 6.0448 6.1637 6.7042 12.3150 1.0555 1.1012 1.0614 1.1023 1.0873 1.0865 1.0924 1.0883 1.0956 1.0922 1.0920 1.1004 1.1002 1.0743
irintensity: 0.7766 0.0924 0.2921 2.1738 5.3125 0.2701 7.1614 4.6014 5.6369 1.7009 0.3270 3.8086 1.5992 1.8648 2.2313 4.4232 0.3059 3.3706 12.3687 3.8012 9.3636 50.5297 15.1084 13.8342 7.8751 0.7241 3.8398 29.5862 62.9332 40.7285 11.7467 10.0962 29.9408 26.1669 0.8923 1.7977 4.3579 4.5373 2.3015 3.9812 0.7386 8.8093 0.7840 0.7100 4.3224 30.0630 4.0276 8.6251 13.4740 13.2237 12.6101 14.0832 44.0587 0.1071 3.0847 2.2094 4.1135 2.4636 14.1357 156.2766 32.8802 5.3936 3.8457 21.9811 31.9271 1.1233 21.7268 65.4122 2.9876 6.7378 26.8558 14.8601 24.4902 19.0007 19.6765 0.9373 21.8580 296.1697 183.2928 41.8232 30.0112 48.9073 19.9491 10.6113 0.8163 29.1861 8.4396 30.5792 14.5928 8.2195 14.1931 14.2195 40.0611
temp: 298.150 k
press: 1.00000 atm
elementType: 7 7 7 7 6 6 6 6 6 6 6 6 6 6 6 6 6 6 6 1 1 1 1 1 1 1 1 1 1 1 1 1 1
symmnumber: 1
zpe: 677482.5 jmol-1
zpe.correction: 0.258039 hartree
zpe.thermalcorrener: 0.274872 hartree
zpe.thermalcorrenthalpy: 0.275817 hartree
zpe.thermalcorrgfe: 0.210135 hartree
zpe.sumelectzpe: -797.622324 hartree
zpe.sumelectthermal: -797.605491 hartree
zpe.sumelectthermalent: -797.604547 hartree
zpe.sumelectthermalfe: -797.670228 hartree
dipole: 2.5105 1.5841 -1.4784
dipole: 3.3162
quadrupole: -120.6225 -109.5877 -111.4839
quadrupole: 16.2561 2.4234 9.9029
quadrupole: -6.7245 4.3104 2.4141 16.2561 2.4234 9.9029
hfenergy: -797.8803632 hartree
pointgroup: C01 [X(C15H14N4)]
dipole: 0.9924713 -0.4762335 0.7003385 debye
polarizability: 238.4012946|-20.0082119|186.5993758|-6.2827667|-11.6743449|134.8046221 unknown
InChI: InChI=1S/C15H14N4/c16-12-19-15(14-7-4-9-17-11-14)18-10-8-13-5-2-1-3-6-13/h1-7,9,11,19H,8,10H2
charge 0 multiplicity 1
33 atoms
N  0.04845 -0.753044 -0.490296
N  -1.514804 -1.853925 0.97178
N  -2.900125 2.048052 -1.674753
N  -3.873325 -2.4299 1.760142
C  2.299726 -1.591955 -1.147231
C  3.181893 -0.515676 -0.528138
C  1.003363 -1.874512 -0.345055
C  2.791145 0.849928 -0.545987
C  4.410049 -0.86173 0.092148
C  -1.115017 -0.774199 0.098753
C  -2.077755 0.340659 -0.113386
C  3.6094 1.839614 0.04244
C  5.231001 0.127428 0.682094
C  4.832488 1.483337 0.658495
C  -2.953287 0.823204 0.892831
C  -2.094769 0.992079 -1.378565
C  -3.796853 1.915292 0.597149
C  -3.738252 2.495451 -0.689634
C  -2.769468 -2.149623 1.382744
H  1.995998 -1.304711 -2.171153
H  2.870185 -2.537052 -1.224703
H  0.545242 -2.817989 -0.722044
H  1.282145 -2.040212 0.721705
H  1.838733 1.122964 -1.0119
H  4.730682 -1.911534 0.106766
H  3.294793 2.889311 0.018105
H  6.178918 -0.158584 1.152314
H  5.46824 2.253083 1.110553
H  -2.970164 0.376388 1.891544
H  -1.425333 0.643806 -2.171688
H  -0.777323 -2.514942 1.232209
H  -4.481858 2.313383 1.351375
H  -4.373019 3.348411 -0.954315
