program: Gaussian 09
title: 000131606
version: EM64L-G09RevD.01
frameworkgroup: C1[X(C19H34N2O3S)]
method: RPBEPBE
basis: SDD
operation: Freq
keyword: #p
keyword: freq=noraman
keyword: PBEPBE/SDD
title: #p freq=noraman PBEPBE/SDD
converged: YES YES NO NO
title: Mulliken charges:
elementType: S O O O N N C C C C C C C C C C C C C C C C C C C H H H H H H H H H H H H H H H H H H H H H H H H H H H H H H H H H H
charge: 1.004300 -0.451722 -0.539124 -0.526144 -0.111829 -0.556599 -0.383417 -0.392787 -0.357867 -0.349338 -0.408390 -0.350243 -0.366273 -0.240205 -0.342063 -0.344769 0.548508 -0.694153 -0.709250 -0.446164 -0.359706 -0.387039 -0.336172 0.347959 -0.760501 0.198579 0.201169 0.190672 0.213754 0.179951 0.202374 0.182527 0.193919 0.171763 0.256503 0.204936 0.177856 0.214961 0.192197 0.192220 0.191151 0.193475 0.195156 0.172675 0.213603 0.216736 0.207475 0.253317 0.203740 0.210901 0.236305 0.262367 0.332863 0.225840 0.286287 0.291171 0.267372 0.279304 0.299870
chargesum: 0.00000
title: Mulliken charges with hydrogens summed into heavy atoms:
elementType: S O O O N N C C C C C C C C C C C C C C C C C C C
charge: 1.004300 -0.118859 -0.539124 -0.526144 -0.111829 -0.265429 0.016331 0.011639 0.024458 0.027108 0.019875 0.032548 0.040885 -0.047986 0.042563 0.023062 0.548508 -0.056339 -0.041292 -0.209858 -0.097339 -0.161199 -0.049885 0.347959 0.086046
polarizability: 3.28543037e+02 4.62301160e+01 2.63961139e+02 -1.05398755e+01 1.13006167e+01 2.15463696e+02
1716.lowfreq: -12.6095 -5.7683 -0.0016 -0.0012 -0.0011 3.7746 11.1369 19.9622 24.4723
frequency: 10.1475 19.8119 24.4236 30.1733 33.3901 38.1801 40.6329 51.6878 58.6977 71.5312 84.2233 92.4493 101.9936 123.6289 125.5077 141.3545 155.8881 162.6902 167.7789 171.9515 175.0541 191.9473 221.6153 224.0922 230.8375 248.4433 254.6595 266.1416 274.5787 288.3138 304.4495 305.8092 321.8419 338.8875 357.5060 376.4096 400.8442 409.7124 417.1647 434.5502 455.9394 472.2414 489.5276 537.3903 549.7796 560.2024 576.0299 632.5818 718.8986 729.9828 731.8219 734.2447 754.6973 775.9043 792.3519 794.7881 818.7304 822.7204 826.0822 837.3275 857.4802 876.0097 897.4066 899.1329 900.8444 920.9692 929.9031 944.3490 953.2282 957.6413 978.9793 981.9893 1003.3630 1007.2368 1015.4465 1023.8597 1037.3919 1059.2662 1069.0303 1072.5262 1078.6394 1089.2937 1098.5738 1110.4852 1112.1952 1120.8304 1139.8817 1162.9825 1180.3778 1187.1483 1195.5845 1217.9313 1225.9775 1231.6226 1236.1899 1236.4717 1247.4101 1266.5032 1267.6087 1277.9778 1278.9144 1285.8556 1287.0977 1287.9693 1294.9618 1302.9285 1311.1169 1316.9512 1338.1416 1344.5823 1351.4738 1362.5930 1369.6804 1377.0968 1379.6073 1391.7396 1400.9698 1401.4040 1406.7318 1414.1376 1422.8176 1456.6738 1462.6524 1466.9399 1469.5403 1470.6084 1474.2851 1475.4293 1476.9692 1479.6449 1482.4067 1485.8840 1488.3602 1494.8519 1496.9840 1573.2883 1611.3192 2841.4016 2849.0012 2867.7304 2933.6122 2943.6411 2950.8537 2962.2275 2970.0526 2971.9078 2972.5420 2973.7797 2978.3055 2994.7601 3003.4710 3009.5112 3014.5921 3018.2299 3030.0609 3032.3411 3042.2349 3044.6574 3050.1840 3064.3951 3069.1554 3069.7211 3072.7358 3112.4438 3136.9335 3156.8669 3180.4420 3181.6797 3183.3973 3394.3274 3550.0688
redmass: 4.6494 4.6077 5.6434 4.0873 4.3116 3.3912 2.1183 2.9493 3.6928 4.7398 2.1800 2.6956 2.7170 2.4171 3.9357 2.4467 2.7881 1.7719 5.2984 1.8578 3.0155 3.8913 1.5176 2.3201 2.7648 2.9422 1.3057 2.4822 1.3133 2.4213 2.4339 3.9471 4.0775 5.0967 3.0975 6.5146 3.4478 2.8845 2.5639 3.9763 3.3124 2.7960 2.8816 3.3671 6.9050 3.8481 2.7833 5.9644 2.2699 1.0802 1.1011 2.9261 2.1005 1.8785 1.1916 1.2152 5.1119 3.2463 1.6429 2.1497 1.6009 1.8370 1.7611 1.7883 2.1895 1.3489 1.2368 1.8779 1.8752 1.3928 1.8642 1.8099 3.1728 2.8382 2.3384 2.7647 2.5981 2.6370 2.4633 2.3816 2.3195 2.2833 2.0351 1.4676 2.2173 2.0144 1.4122 1.5214 1.2702 1.7857 1.7094 1.4024 1.4472 1.4817 1.9118 1.7364 1.3650 1.2922 1.2917 1.1791 1.0874 1.0961 1.1495 1.1362 1.2300 1.2738 1.3067 1.2735 1.5268 1.5088 1.5259 1.3227 1.3793 1.7652 1.8689 1.2214 2.4761 1.2250 1.0750 1.0623 2.3507 1.0816 1.0713 1.0722 1.0858 1.0798 1.0852 1.0895 1.0452 1.0681 1.0486 1.0759 1.0875 2.5345 1.0687 6.4835 6.1931 1.0711 1.0710 1.0708 1.0838 1.0675 1.0604 1.0587 1.0365 1.0553 1.0561 1.0467 1.0600 1.0963 1.0970 1.0874 1.0912 1.0899 1.0239 1.0925 1.1016 1.1013 1.0983 1.0991 1.1006 1.1007 1.0994 1.0871 1.0965 1.0891 1.0967 1.1073 1.1082 1.0757 1.0659
irintensity: 0.6992 0.4364 1.0624 2.9933 1.4019 1.8937 0.2751 1.6439 2.0748 5.2589 0.0629 0.3070 0.2197 0.8023 1.8497 0.5855 0.9010 0.6535 6.1185 1.0013 5.2929 10.5579 0.6348 0.8542 0.6997 2.2104 0.1812 19.4128 106.4796 7.4746 13.8579 1.5765 23.0942 16.2873 3.5640 53.7670 0.3779 1.5192 8.7198 4.3683 16.3926 2.5286 10.1597 31.1239 41.4618 3.1430 8.3511 7.2981 7.0546 8.5120 13.3769 9.2192 22.7210 31.4434 0.5537 2.4279 111.2032 10.7250 30.2391 17.6204 34.5850 2.3934 9.3443 11.6371 23.5271 13.5140 2.9732 38.1954 44.5288 77.3886 4.5747 6.1967 8.9979 2.3719 58.9541 3.8501 7.2762 26.9137 1.2180 2.4865 11.1857 26.4683 17.0375 13.5333 0.3921 1.9945 8.2680 58.8894 22.9027 8.5284 10.6482 10.0055 0.5367 9.5327 2.8061 7.3686 6.2259 1.0242 0.9525 2.5367 0.7306 1.0659 0.2114 3.0430 9.5625 16.7866 21.4899 4.7459 0.4082 2.4158 4.6689 8.3462 10.7645 7.7632 3.4427 8.9694 15.2486 9.7658 9.4465 25.3709 9.7290 0.4495 0.4024 1.0583 3.9876 1.4505 9.1992 2.6689 12.1300 6.5722 17.5954 12.4706 9.9891 19.1119 12.9577 1.0886 0.7267 42.7315 81.6200 181.6597 46.8869 58.4156 34.6097 16.9051 30.3922 59.9989 15.9759 60.1678 34.7452 22.0998 6.4261 7.3500 9.0384 5.3766 0.6385 28.4435 53.1844 68.8644 77.4056 47.2015 74.5281 70.3632 58.6896 12.3131 17.8831 3.2891 0.3088 0.1298 1.2952 13.0849 5.4547
temp: 298.150 k
press: 1.00000 atm
elementType: 16 8 8 8 7 7 6 6 6 6 6 6 6 6 6 6 6 6 6 6 6 6 6 6 6 1 1 1 1 1 1 1 1 1 1 1 1 1 1 1 1 1 1 1 1 1 1 1 1 1 1 1 1 1 1 1 1 1 1
symmnumber: 1
zpe: 1317386.7 jmol-1
zpe.correction: 0.501766 hartree
zpe.thermalcorrener: 0.532639 hartree
zpe.thermalcorrenthalpy: 0.533583 hartree
zpe.thermalcorrgfe: 0.435432 hartree
zpe.sumelectzpe: -1475.460581 hartree
zpe.sumelectthermal: -1475.429708 hartree
zpe.sumelectthermalent: -1475.428764 hartree
zpe.sumelectthermalfe: -1475.526915 hartree
dipole: 5.6189 1.0353 6.4389
dipole: 8.6084
quadrupole: -180.4193 -163.9879 -162.9583
quadrupole: -4.5195 -20.7254 3.4200
quadrupole: -11.2975 5.1339 6.1635 -4.5195 -20.7254 3.4200
hfenergy: -1475.962347 hartree
pointgroup: C01 [X(C19H34N2O3S1)]
dipole: -1.915352 -0.7456442 2.6918129 debye
polarizability: 317.9111702|51.4059352|276.6532336|4.2479023|-12.7642807|213.4034686 unknown
InChI: InChI=1S/C19H34N2O3S/c1-4-6-14-21(15-7-5-2)16-8-9-19(22)17-10-12-18(13-11-17)20-25(3,23)24/h10-13,19-20,22H,4-9,14-16H2,1-3H3
charge 0 multiplicity 1
59 atoms
S  4.307887 1.61538 -0.8520
O  -0.814921 -3.924637 -1.371462
O  5.85459 2.105414 -0.85094
O  3.241827 2.101294 -1.973117
N  -2.641594 0.481788 1.090511
N  4.395572 -0.318331 -0.968127
C  -2.665411 -0.679169 2.016348
C  -1.533878 -1.694056 1.723569
C  -3.98728 1.049828 0.815181
C  -1.640789 1.513985 1.471231
C  -1.691168 -2.345441 0.334133
C  -4.808274 0.21295 -0.188702
C  -1.057599 2.269803 0.257909
C  -0.511729 -3.260556 -0.082305
C  -6.2095 0.809199 -0.455533
C  -0.134876 3.440026 0.671608
C  0.786014 -2.496794 -0.294429
C  -7.030709 -0.02382 -1.463141
C  0.535323 4.130157 -0.536997
C  1.857293 -2.602633 0.624581
C  0.930913 -1.645141 -1.421492
C  3.039728 -1.854524 0.444768
C  2.117084 -0.922292 -1.635856
C  3.187136 -1.021827 -0.700136
C  3.540714 2.040448 0.865866
H  -3.638319 -1.193817 1.901658
H  -2.603298 -0.353775 3.084877
H  -1.5360 -2.469629 2.517943
H  -0.553962 -1.181195 1.783926
H  -4.577394 1.184135 1.758828
H  -3.848358 2.06223 0.390754
H  -2.07302 2.250224 2.197115
H  -0.809721 1.010155 2.001785
H  -2.622559 -2.954549 0.328354
H  -1.820122 -1.544108 -0.417023
H  -4.237619 0.143779 -1.13558
H  -4.922848 -0.825399 0.184734
H  -0.503341 1.550216 -0.376176
H  -1.880735 2.665126 -0.370473
H  -0.358781 -4.031666 0.705531
H  -6.765261 0.886429 0.501741
H  -6.100431 1.845816 -0.835367
H  -0.724166 4.182565 1.24818
H  0.644625 3.063934 1.368888
H  -6.510325 -0.092865 -2.43687
H  -8.025712 0.423223 -1.642725
H  -7.185553 -1.054833 -1.092354
H  1.187482 3.431607 -1.094213
H  1.151347 4.993609 -0.221905
H  -0.228179 4.508066 -1.242811
H  1.767336 -3.272874 1.48795
H  0.117916 -1.593163 -2.152134
H  -1.741246 -4.276039 -1.331552
H  3.86028 -1.936308 1.169445
H  2.247371 -0.291799 -2.519935
H  5.200606 -0.570876 -0.366992
H  4.293685 1.760126 1.615056
H  2.611008 1.460931 0.946851
H  3.355543 3.122874 0.836824
