program: Gaussian 09
title: 000131602
version: EM64L-G09RevD.01
frameworkgroup: C1[X(C20H18N6O10)]
method: RPBEPBE
basis: SDD
operation: Freq
keyword: #p
keyword: freq=noraman
keyword: PBEPBE/SDD
title: #p freq=noraman PBEPBE/SDD
converged: YES YES NO NO
title: Mulliken charges:
elementType: O O O O O O O O O O N N N N N N C C C C C C C C C C C C C C C C C C C C H H H H H H H H H H H H H H H H H H
charge: -0.272583 -0.312426 -0.194847 -0.193329 -0.181997 -0.162907 -0.177437 -0.172775 -0.185964 -0.181393 -0.445261 -0.404146 0.021297 0.020749 0.020798 0.021081 0.028419 -0.130924 -0.436632 -0.467161 -0.403943 -0.390971 0.151288 0.197306 0.360460 0.376253 -0.514911 -0.504354 -0.509941 -0.528594 0.415485 0.423408 0.430491 0.424156 -0.509791 -0.495614 0.245105 0.267558 0.199444 0.260916 0.197389 0.222583 0.215712 0.204927 0.214480 0.203493 0.359283 0.325749 0.335018 0.350114 0.313257 0.289401 0.339080 0.343201
chargesum: 0.00000
title: Mulliken charges with hydrogens summed into heavy atoms:
elementType: O O O O O O O O O O N N N N N N C C C C C C C C C C C C C C C C C C C C
charge: -0.272583 -0.312426 -0.194847 -0.193329 -0.181997 -0.162907 -0.177437 -0.172775 -0.185964 -0.181393 -0.085979 -0.078397 0.021297 0.020749 0.020798 0.021081 0.273523 0.136634 0.023729 -0.047189 0.016696 0.027002 0.151288 0.197306 0.360460 0.376253 -0.179893 -0.154240 -0.196684 -0.239194 0.415485 0.423408 0.430491 0.424156 -0.170710 -0.152413
chargesum: 0.00037
polarizability: 3.85584073e+02 -1.75649333e+01 3.90501348e+02 -4.72202473e+00 -2.24369606e+01 1.81237280e+02
1716.lowfreq: -6.2993 -2.8579 -1.7367 -0.1406 -0.0649 3.9764 9.5865 11.2383 26.8750
frequency: 9.5448 11.1632 26.8636 34.2835 40.3156 47.4496 49.6880 50.9863 55.0880 60.8724 68.8059 88.5937 110.4998 112.9326 123.0205 129.5362 135.7860 142.6209 168.8273 183.3689 188.4931 196.7822 199.7151 207.5824 216.8451 230.3064 282.9613 303.3866 309.1542 322.0449 331.7984 336.7763 351.0959 357.6723 374.3228 391.8145 423.4921 432.3825 458.3347 461.7419 465.6362 471.2849 476.5325 495.2002 505.9860 511.0690 553.4826 565.4812 578.4542 593.6994 600.7169 647.4937 650.5033 682.6410 683.1062 687.9966 691.4030 699.2746 700.8939 722.8218 724.5609 728.8861 747.6916 750.0361 756.2652 772.8367 797.2514 839.5529 854.3907 866.0426 866.9612 886.8849 906.0046 921.7839 931.3127 954.3891 965.0293 966.6644 972.9708 974.7985 985.8299 986.4592 991.7739 993.9961 1045.2600 1052.7950 1070.0234 1071.4274 1076.9441 1080.8138 1106.7182 1109.5803 1114.6416 1129.4919 1144.3474 1164.2608 1177.0423 1203.7809 1205.8575 1206.1610 1213.6851 1219.6507 1237.8257 1244.4013 1247.3534 1252.2445 1276.5961 1280.1004 1304.9548 1313.6480 1319.1209 1330.3919 1340.3163 1346.1552 1347.3590 1366.3130 1377.2816 1381.5299 1382.8539 1386.5643 1395.6870 1397.2368 1435.1617 1436.0311 1456.8793 1461.6590 1463.8974 1466.9182 1470.1782 1476.3901 1496.9109 1533.0150 1562.8566 1572.6894 1598.4143 1606.1170 1616.2255 1618.1739 2959.6194 2976.4269 2978.8698 2982.3231 2987.1502 3000.0853 3038.7199 3046.9491 3054.1993 3070.6493 3139.6572 3156.4006 3166.4923 3177.4452 3190.9352 3193.6462 3364.2327 3533.0074
redmass: 11.8167 12.3820 11.2779 7.5655 9.8487 9.4534 9.5663 10.9947 11.7420 8.0106 5.4369 6.7495 5.6363 9.4003 6.8168 9.9140 8.5176 8.8426 6.5006 4.6253 5.0338 5.0555 4.9203 6.9990 3.5622 4.2854 5.5776 8.4529 6.1572 2.1829 12.4166 10.4633 10.6405 10.6947 3.7049 3.6103 4.4352 3.7121 5.2059 5.2258 5.7099 5.4629 4.9813 3.9452 9.0358 6.3845 4.4659 3.7169 1.3997 4.0892 3.1286 4.9859 5.2890 11.4221 12.0957 5.6670 5.2375 2.9402 2.8870 4.6364 8.7652 2.6654 5.5577 6.2599 4.4777 3.7417 1.9202 2.1681 1.8081 11.3266 10.4330 3.3159 4.2841 2.8428 2.0433 1.5649 2.2342 1.4203 1.6569 1.5005 5.7891 6.0526 1.4311 1.4117 2.7836 1.5285 1.9074 1.4217 1.5546 2.8069 2.1888 1.6120 1.7212 2.2516 2.2645 4.9612 5.4998 13.6416 4.0466 1.9634 8.1074 8.4178 1.4684 1.3636 1.2453 1.3024 1.5795 1.3155 1.7304 1.3025 2.0131 1.3970 1.4289 1.4601 1.4836 1.3910 10.2574 10.1367 9.8207 9.4601 5.7132 5.5718 5.4195 5.3856 2.9947 2.5813 1.1980 1.0891 1.0868 1.1024 2.4698 2.0530 5.0173 6.5525 7.3040 6.7956 7.8078 7.9642 1.0651 1.0785 1.0682 1.0623 1.0688 1.0822 1.0973 1.0963 1.1015 1.0992 1.0939 1.0939 1.0921 1.0923 1.0930 1.0930 1.0822 1.0776
irintensity: 0.2431 0.0938 0.1562 0.9014 0.0239 0.0448 0.2519 0.2508 0.3939 0.7674 1.5346 1.7400 1.4231 18.8749 4.2628 29.3949 2.4757 4.3065 1.8540 0.9412 1.5629 0.1371 0.6837 0.3487 2.2495 6.9924 2.5772 3.5719 4.0435 2.6141 0.1633 0.5674 6.0268 5.0489 3.2101 0.2837 8.6548 7.0154 4.9673 7.5745 0.6442 2.1197 5.9041 2.9560 4.7027 1.0948 8.2911 3.9605 65.6010 7.5038 4.8756 22.0811 6.9494 38.1221 32.9999 69.9631 28.7846 24.3299 49.0278 26.4450 0.2723 58.8152 2.9202 12.4014 27.3324 41.4373 3.3117 10.3905 9.4411 28.9322 12.0462 0.5548 0.4272 2.1739 15.6755 6.0476 3.8500 4.4777 41.1716 29.3395 0.7606 1.7815 13.0058 11.8003 10.1216 0.2747 13.5732 62.2532 57.8425 13.3631 7.5086 37.8681 36.5147 7.9597 8.0879 4.4107 2.9009 314.3469 247.2334 46.6413 199.9738 174.4450 2.7255 4.1388 0.5386 0.6776 4.7198 5.5181 58.7642 27.0406 40.1148 10.4720 4.2867 3.5155 3.8615 3.5029 124.8486 64.7077 82.7184 121.5948 0.2089 1.9385 15.1360 1.0185 178.1816 115.1289 19.7149 6.7630 21.6621 4.9029 207.5964 385.0419 67.5825 25.5732 53.0139 93.2311 9.6232 9.6053 21.7139 0.8079 23.6213 27.8987 20.3710 26.9947 37.5699 52.8400 49.5822 18.0105 42.6420 56.7013 1.9090 15.3462 28.3689 24.0856 308.9749 23.0224
temp: 298.150 k
press: 1.00000 atm
elementType: 8 8 8 8 8 8 8 8 8 8 7 7 7 7 7 7 6 6 6 6 6 6 6 6 6 6 6 6 6 6 6 6 6 6 6 6 1 1 1 1 1 1 1 1 1 1 1 1 1 1 1 1 1 1
symmnumber: 1
zpe: 1007026.8 jmol-1
zpe.correction: 0.383556 hartree
zpe.thermalcorrener: 0.415520 hartree
zpe.thermalcorrenthalpy: 0.416464 hartree
zpe.thermalcorrgfe: 0.315333 hartree
zpe.sumelectzpe: -1850.788413 hartree
zpe.sumelectthermal: -1850.756449 hartree
zpe.sumelectthermalent: -1850.755505 hartree
zpe.sumelectthermalfe: -1850.856636 hartree
dipole: -4.4294 8.9890 1.3709
dipole: 10.1144
quadrupole: -268.2946 -218.0964 -216.5944
quadrupole: -5.7918 7.4234 13.3290
quadrupole: -33.9661 16.2321 17.7340 -5.7918 7.4234 13.3290
hfenergy: -1851.1719688 hartree
pointgroup: C01 [X(C20H18N6O10)]
dipole: -1.8235337 3.534077 0.1408185 debye
polarizability: 371.4656033|-37.9063457|364.8808992|-49.0343963|-63.4194112|220.9761985 unknown
InChI: InChI=1S/C20H18N6O10/c27-19(11-5-13(23(29)30)9-14(6-11)24(31)32)21-17-3-1-2-4-18(17)22-20(28)12-7-15(25(33)34)10-16(8-12)26(35)36/h5-10,17-18,21-22H,1-4H2
charge 0 multiplicity 1
54 atoms
O  2.097402 2.17699 -2.700544
O  -0.232054 1.047035 1.580738
O  1.701908 -1.998556 2.11142
O  -6.463917 0.470264 0.612299
O  5.95573 -0.745447 -3.499075
O  -0.961111 -3.895166 1.969475
O  3.580133 -3.261327 1.822727
O  -6.852333 -1.732798 1.068441
O  6.328529 -2.561669 -2.168694
O  -3.103697 -4.66816 2.139275
N  1.119389 2.248354 -0.590834
N  -1.716171 2.166627 0.184022
N  2.794238 -2.297616 1.492502
N  -6.072684 -0.721744 0.914485
N  5.685724 -1.489693 -2.483564
N  -2.236214 -3.739224 1.926347
C  0.227148 3.377489 -0.920371
C  -0.931652 3.427962 0.115648
C  0.988055 4.730525 -0.93829
C  -1.889257 4.603405 -0.191958
C  0.033911 5.905457 -1.249318
C  -1.133896 5.952471 -0.238344
C  1.964243 1.702466 -1.525357
C  -1.359007 1.100837 0.975066
C  2.740689 0.469644 -1.100042
C  -2.349343 -0.029528 1.105928
C  3.812567 0.071388 -1.933773
C  -1.850248 -1.309809 1.454846
C  2.41408 -0.30875 0.035851
C  -3.739537 0.159009 0.930386
C  3.168343 -1.468063 0.310636
C  -4.607654 -0.938735 1.093476
C  4.548332 -1.082636 -1.607049
C  -2.757377 -2.377055 1.591565
C  4.252413 -1.879266 -0.484391
C  -4.146678 -2.225071 1.421941
H  -0.185976 3.201561 -1.935216
H  -0.48388 3.571859 1.120019
H  1.468516 4.883456 0.049221
H  1.791776 4.662669 -1.691704
H  -2.376937 4.428161 -1.174771
H  -2.687488 4.634445 0.573755
H  0.594388 6.858194 -1.229203
H  -0.367633 5.793801 -2.277043
H  -1.841856 6.760677 -0.499732
H  -0.738651 6.186276 0.770872
H  1.014366 1.845142 0.352521
H  -2.564234 2.114666 -0.385248
H  4.046847 0.659565 -2.826054
H  -0.77905 -1.463014 1.627645
H  1.587173 -0.062622 0.71137
H  -4.181594 1.135225 0.709229
H  4.830879 -2.775996 -0.249366
H  -4.83215 -3.067372 1.545437
