program: Gaussian 09
title: 000131587
version: EM64L-G09RevD.01
frameworkgroup: C1[X(C11H11N3O4)]
method: RPBEPBE
basis: SDD
operation: Freq
keyword: #p
keyword: freq=noraman
keyword: PBEPBE/SDD
title: #p freq=noraman PBEPBE/SDD
converged: NO YES NO NO
title: Mulliken charges:
elementType: O O O O N N N C C C C C C C C C C C H H H H H H H H H H H
charge: -0.240804 -0.186057 -0.185886 -0.218956 -0.108675 -0.402200 -0.573129 -0.501775 -0.501705 0.211884 0.211352 0.250074 0.181336 -0.330767 -0.298432 0.477499 -0.367886 -0.416521 0.267660 0.264335 0.264238 0.267649 0.262287 0.269430 0.273239 0.221398 0.293647 0.308472 0.308293
chargesum: 0.00000
title: Mulliken charges with hydrogens summed into heavy atoms:
elementType: O O O O N N N C C C C C C C C C C C
charge: -0.240804 -0.186057 -0.185886 -0.218956 -0.108675 -0.108553 0.043635 0.030221 0.030182 0.211884 0.211352 0.250074 0.181336 -0.068480 -0.029003 0.477499 -0.094647 -0.195123
polarizability: 2.70249739e+02 -2.38683927e-01 1.11508340e+02 1.00372834e+01 -7.75018513e-01 1.24815930e+02
1716.lowfreq: -4.9192 0.0005 0.0006 0.0008 3.7930 11.4356 26.4948 29.3573 54.5087
frequency: 26.4849 29.3363 54.4762 54.6540 80.2210 94.3696 106.6169 125.8739 138.9200 190.7259 258.6963 282.5569 296.2657 318.5981 334.7241 360.3206 364.2447 416.0626 417.9052 502.3716 530.3127 534.8862 549.0052 556.1424 564.9833 576.9153 625.1061 635.2953 639.6097 662.8237 704.2148 740.1118 748.5643 817.7710 818.9191 825.7731 865.3879 920.5221 971.8666 996.4882 996.9773 998.4834 1006.4045 1015.5967 1041.4884 1114.1099 1145.4796 1167.5246 1172.6379 1185.0835 1209.8901 1221.2473 1223.8602 1248.8280 1291.2433 1296.7591 1300.0714 1329.7549 1372.9704 1437.4392 1448.6635 1453.2481 1482.6095 1512.4581 1578.4734 1622.3188 1659.7972 1661.6830 1685.7379 1717.0900 3028.5312 3037.8842 3083.3946 3101.0425 3122.8360 3152.2265 3178.8741 3181.8334 3460.3097 3477.9182 3612.5832
redmass: 7.0156 4.5075 5.4367 5.1320 2.0952 4.4892 6.9944 8.2800 4.6023 5.7200 3.4524 5.2029 1.6421 4.0772 8.6815 6.9416 1.3035 8.5086 2.9727 2.9370 4.8732 3.5449 4.3859 3.0744 1.0975 11.6850 7.1069 6.1624 7.5337 4.5905 7.6977 11.2873 4.2100 1.9370 2.9698 1.3819 1.5323 8.7362 1.3552 3.0063 1.3297 2.6105 2.1726 5.6091 5.8869 1.4690 1.1956 2.4669 11.5998 1.3105 1.1113 1.1852 3.0863 2.6705 1.4869 1.3488 2.8651 2.2748 4.2072 1.0739 4.9121 1.0913 1.6564 3.0672 4.2182 4.0385 12.6348 1.2512 12.0886 12.6031 1.0592 1.0629 1.1038 1.1020 1.0898 1.0894 1.0943 1.0955 1.0731 1.0431 1.1072
irintensity: 5.7518 0.0777 2.6413 4.1242 0.2282 1.9543 8.8019 0.3260 7.2632 0.7677 10.1171 14.7625 58.6785 18.4422 3.0622 14.8332 324.1268 0.9098 0.5656 1.7891 9.7993 0.0202 1.4666 6.6035 57.0843 10.6593 7.0050 39.0904 5.7685 47.2313 84.8896 97.2601 3.3684 8.7280 20.9285 21.7127 51.1436 247.9435 0.0202 132.3283 0.3779 11.6723 0.0299 3.7747 112.4381 6.0422 1.1859 80.9328 227.8804 72.0456 0.1119 1.3911 34.9319 219.0751 1.6177 3.8740 86.2784 25.9930 80.5634 0.6734 0.7092 29.6446 9.3945 84.1065 24.7827 382.9010 600.2185 147.4566 254.9599 18.1862 13.2945 3.9641 0.0015 7.5229 19.0248 0.8855 3.8338 0.7505 50.8455 10.2154 7.2787
temp: 298.150 k
press: 1.00000 atm
elementType: 8 8 8 8 7 7 7 6 6 6 6 6 6 6 6 6 6 6 1 1 1 1 1 1 1 1 1 1 1
symmnumber: 1
zpe: 560890.0 jmol-1
zpe.correction: 0.213632 hartree
zpe.thermalcorrener: 0.230498 hartree
zpe.thermalcorrenthalpy: 0.231442 hartree
zpe.thermalcorrgfe: 0.167004 hartree
zpe.sumelectzpe: -889.570313 hartree
zpe.sumelectthermal: -889.553447 hartree
zpe.sumelectthermalent: -889.552503 hartree
zpe.sumelectthermalfe: -889.616941 hartree
dipole: -5.0275 0.0656 -1.5775
dipole: 5.2696
quadrupole: -31.6481 -121.2123 -99.1008
quadrupole: -0.2851 5.3775 -0.6794
quadrupole: 52.3390 -37.2252 -15.1137 -0.2851 5.3775 -0.6794
hfenergy: -889.7839451 hartree
pointgroup: C01 [X(C11H11N3O4)]
dipole: -1.9727114 -0.3756069 0.5152833 debye
polarizability: 270.069614|7.1178194|116.1975001|-8.7359644|-6.4688403|120.3068947 unknown
InChI: InChI=1S/C11H11N3O4/c12-13-8-3-1-7(2-4-8)11(17)18-14-9(15)5-6-10(14)16/h1-4,13H,5-6,12H2
charge 0 multiplicity 1
29 atoms
O  1.157265 -0.39072 0.546362
O  2.775577 1.797339 1.543635
O  2.81373 -2.103344 -1.105779
O  0.864901 0.939804 -1.399034
N  2.538262 -0.210982 0.300796
N  -5.239104 -0.424168 0.519636
N  -6.226156 0.131008 -0.293277
C  4.695038 0.730874 0.32713
C  4.708065 -0.55496 -0.543592
C  3.254368 0.899021 0.823579
C  3.274309 -1.097824 -0.530362
C  -1.091509 0.094387 -0.188262
C  0.328065 0.303532 -0.476625
C  -2.047596 0.69155 -1.059791
C  -1.551717 -0.67536 0.918761
C  -3.878133 -0.239584 0.266644
C  -3.421628 0.531762 -0.842305
C  -2.923368 -0.841183 1.144277
H  4.973411 1.634844 -0.240325
H  5.36868 0.669577 1.198677
H  5.387038 -1.332994 -0.155002
H  4.996267 -0.360695 -1.590378
H  -1.686506 1.281598 -1.908955
H  -0.825833 -1.137156 1.592936
H  -4.164299 0.9852 -1.503227
H  -3.268254 -1.435447 1.999652
H  -5.506705 -0.992229 1.32993
H  -6.749997 0.915697 0.097222
H  -6.732571 -0.514246 -0.901723
