program: Gaussian 09
title: 000131586
version: EM64L-G09RevD.01
frameworkgroup: C1[X(C12H18N5O7P)]
method: RPBEPBE
basis: SDD
operation: Freq
keyword: #p
keyword: freq=noraman
keyword: PBEPBE/SDD
title: #p freq=noraman PBEPBE/SDD
converged: YES YES NO NO
title: Mulliken charges:
elementType: P O O O O O O O N N N N N C C C C C C C C C C C C H H H H H H H H H H H H H H H H H H
charge: 1.385157 -0.271634 -0.448965 -0.251115 -0.514554 -0.674281 -0.685736 -0.580564 -0.175053 -0.135056 -0.069800 -0.331998 -0.653089 0.224321 -0.382125 -0.040563 -0.348791 -0.142112 -0.115053 -0.153504 -0.553668 -0.184732 0.050526 0.171599 -0.286536 0.288009 0.280710 0.275165 0.240896 0.272828 0.274097 0.251902 0.219932 0.250071 0.255584 0.331575 0.237252 0.241844 0.292048 0.307666 0.345674 0.397299 0.404777
chargesum: 0.00000
title: Mulliken charges with hydrogens summed into heavy atoms:
elementType: P O O O O O O O N N N N N C C C C C C C C C C C C
charge: 1.385157 -0.271634 -0.103291 -0.251115 -0.514554 -0.276982 -0.280960 -0.580564 -0.175053 -0.135056 -0.069800 -0.000423 -0.053374 0.224321 -0.094116 0.240146 -0.073626 0.098784 0.157774 0.120593 -0.081835 0.070852 0.300597 0.171599 0.192560
polarizability: 2.22971328e+02 4.49283049e+00 2.04865900e+02 -4.77310305e+00 7.12708771e+00 1.79247367e+02
1716.lowfreq: -6.9032 -2.2692 -0.0013 -0.0010 -0.0006 2.8053 9.8166 13.5863 14.5934
frequency: 8.5934 13.0118 14.5343 25.5679 48.7721 59.8558 74.1583 86.0525 104.1942 124.8829 139.3030 154.1855 163.0775 186.3131 199.3063 216.5274 226.9496 229.4680 242.6461 249.9501 280.3030 300.0648 302.5433 304.0766 329.3065 344.8965 349.1306 359.3868 371.0097 379.3238 404.4060 428.7938 447.2804 461.2639 473.7125 476.5374 528.2372 571.5859 585.7178 600.7559 626.9802 640.2747 652.0333 680.1673 689.7130 704.1235 721.9880 731.6882 738.8446 777.4474 790.6155 794.9603 827.1333 863.2191 870.9895 875.2497 898.1695 904.6144 909.6217 913.3588 945.6912 956.5746 964.1797 988.7978 1005.5879 1011.2652 1016.9369 1019.0717 1035.8418 1050.1587 1058.2637 1069.1776 1090.7516 1091.9147 1121.9329 1129.7340 1155.1597 1159.5944 1169.0777 1213.0602 1217.7805 1221.9941 1225.5722 1235.1414 1246.5029 1254.6715 1274.0563 1283.6827 1286.2098 1310.6915 1314.0434 1327.1988 1333.1080 1337.0021 1353.7462 1366.7302 1381.2335 1401.1157 1411.2213 1449.9257 1456.2619 1531.5826 1552.2274 1631.9454 1639.7468 2925.5473 2997.8006 3002.2196 3011.1473 3022.6352 3023.2800 3039.8881 3075.2165 3081.0895 3192.0217 3216.1399 3254.9320 3470.2490 3528.8307 3571.5915 3595.5500 3599.3581 3611.2098
redmass: 6.9491 8.1708 6.1146 5.9894 4.9771 6.2827 7.4244 6.6647 5.8137 4.3771 5.2081 4.7066 2.1798 3.0396 3.8622 3.2178 1.1220 3.3473 3.9526 3.5374 3.1647 1.5989 3.3186 2.7369 4.1557 4.3827 5.2162 3.1907 5.0590 2.4680 4.9616 5.1170 3.5591 3.7485 2.6385 2.5521 3.6201 2.7042 3.4580 2.7494 4.3241 6.1524 1.6677 2.8538 5.7079 3.0067 9.9224 2.4928 8.2609 4.9527 3.2749 5.0133 3.5263 2.5293 2.9665 1.6409 4.4896 2.2247 2.3609 4.5769 4.1351 4.9009 3.5274 3.6655 1.3205 2.3283 1.2413 1.9873 2.2309 2.2986 2.7226 2.9027 2.6920 6.4402 3.1707 2.0238 1.5665 1.4604 1.7591 1.8572 1.1172 1.3647 1.2567 2.3279 1.8118 1.3547 1.6639 1.3057 2.7279 1.5621 1.3478 1.6187 1.4595 2.2597 1.6229 1.3920 1.5389 1.5152 1.8367 1.1058 1.0848 5.3339 7.0544 1.9673 1.8733 1.0834 1.0657 1.0633 1.0767 1.0839 1.0852 1.0857 1.1043 1.1059 1.0962 1.0901 1.1185 1.0459 1.0774 1.0664 1.0662 1.0977 1.0664
irintensity: 4.7912 0.9169 2.2720 0.2200 2.8996 0.5112 3.6822 0.1836 0.4146 2.0379 1.4502 12.9070 64.1196 10.8647 6.8697 12.5026 36.5008 1.4164 22.9009 50.9501 19.7986 101.8478 9.1528 26.4071 15.8811 34.2699 28.4672 29.8100 99.7179 94.3253 18.9871 5.1967 9.0471 0.4469 32.9461 1.8856 5.2040 24.3386 28.4716 49.4472 27.8053 10.3952 196.7691 75.8948 4.2785 64.2086 222.3911 27.9872 176.1015 28.3081 6.9517 27.7767 44.6046 9.9869 8.3337 33.9807 183.7664 19.5240 20.3539 9.7415 146.6877 97.2813 17.2383 11.0347 26.7803 33.3910 122.5446 24.2524 34.7701 87.0311 61.7523 8.9986 29.4540 191.9455 37.8909 7.2804 34.6686 49.6855 10.8570 2.2211 1.8762 50.7292 19.7741 36.1416 64.8472 9.8287 42.8464 23.8059 37.2609 67.4332 15.4709 46.2064 23.7028 55.2196 57.6134 21.3352 6.0352 13.6641 94.3322 8.9507 27.1178 12.7858 147.0828 345.7967 95.7676 42.9892 14.3492 13.0704 19.8802 0.7346 55.0747 6.8073 6.3154 41.8865 10.0813 0.8671 1.3299 5.6665 31.9569 7.8462 55.9330 9.1550 71.7671
temp: 298.150 k
press: 1.00000 atm
elementType: 15 8 8 8 8 8 8 8 7 7 7 7 7 6 6 6 6 6 6 6 6 6 6 6 6 1 1 1 1 1 1 1 1 1 1 1 1 1 1 1 1 1 1
symmnumber: 1
zpe: 837336.6 jmol-1
zpe.correction: 0.318925 hartree
zpe.thermalcorrener: 0.344381 hartree
zpe.thermalcorrenthalpy: 0.345325 hartree
zpe.thermalcorrgfe: 0.259670 hartree
zpe.sumelectzpe: -1607.610654 hartree
zpe.sumelectthermal: -1607.585198 hartree
zpe.sumelectthermalent: -1607.584254 hartree
zpe.sumelectthermalfe: -1607.669909 hartree
dipole: 3.8678 3.0570 -0.0261
dipole: 4.9301
quadrupole: -185.5269 -118.9924 -167.4174
quadrupole: 2.2196 39.5488 5.7346
quadrupole: -28.2147 38.3198 -10.1052 2.2196 39.5488 5.7346
hfenergy: -1607.9295788 hartree
pointgroup: C01 [X(C12H18N5O7P1)]
dipole: -1.5858161 -1.0920093 0.2344742 debye
polarizability: 222.6735618|5.9189707|197.8516288|5.6591606|-12.9630502|186.5594035 unknown
InChI: InChI=1S/C12H18N5O7P/c13-11-15-9(19)8-12(1-2-16(11)12)17(5-14-8)10-7(18)3-6(24-10)4-23-25(20,21)22/h1-2,5-8,10-11,15,18,20-21H,3-4,13H2
charge 0 multiplicity 1
43 atoms
P  -4.902235 1.433248 -0.956069
O  -1.092718 -0.767113 -0.154364
O  -0.570117 -4.017369 -0.114852
O  5.03735 1.615396 1.465556
O  -3.887786 0.06449 -0.934262
O  -4.156577 2.633304 0.053406
O  -6.110892 0.911346 0.146019
O  -5.304922 1.91915 -2.403482
N  1.094395 -1.001091 0.80266
N  2.185867 0.166057 -1.188013
N  1.925931 0.637285 2.220762
N  3.612618 1.970521 -0.341387
N  2.434307 2.209273 -2.413884
C  2.348425 -0.624086 0.150295
C  3.044151 0.200262 1.297798
C  0.03824 -1.703041 0.103237
C  3.227119 -1.587606 -0.658125
C  -0.581293 -2.919654 0.867149
C  2.36755 1.625864 -1.078067
C  3.189489 -0.738814 -1.736484
C  -2.019897 -2.477809 1.21613
C  0.904316 -0.120236 1.889109
C  -2.356569 -1.518339 0.051126
C  3.980054 1.33641 0.832097
C  -3.470071 -0.535463 0.364763
H  3.695114 -0.475121 1.883961
H  0.451433 -2.072451 -0.85265
H  3.669091 -2.55383 -0.431185
H  0.020487 -3.184103 1.756514
H  1.501605 1.97119 -0.468915
H  3.661031 -0.66227 -2.714643
H  -2.71822 -3.329147 1.290877
H  -2.029361 -1.926826 2.176599
H  -2.60156 -2.088342 -0.866636
H  -0.056076 -0.082909 2.40583
H  4.28759 2.602231 -0.780974
H  -3.108674 0.255791 1.04762
H  -4.343809 -1.048701 0.805111
H  2.365329 3.231361 -2.435257
H  1.787076 1.756165 -3.065556
H  -0.923103 -4.841124 0.306068
H  -3.592197 3.283723 -0.437418
H  -6.763292 1.600277 0.427339
