program: Gaussian 09
title: 000131585
version: EM64L-G09RevD.01
frameworkgroup: C1[X(C23H26FN3O2)]
method: RPBEPBE
basis: SDD
operation: Freq
keyword: #p
keyword: freq=noraman
keyword: PBEPBE/SDD
title: #p freq=noraman PBEPBE/SDD
converged: NO YES NO NO
title: Mulliken charges:
elementType: F O O N N N C C C C C C C C C C C C C C C C C C C C C C C H H H H H H H H H H H H H H H H H H H H H H H H H H
charge: -0.198793 -0.270843 -0.227465 -0.075289 -0.257725 -0.225053 -0.035609 -0.445206 -0.438063 -0.379464 -0.379002 -0.349351 0.273642 0.165728 -0.446842 0.245882 -0.345205 -0.503240 -0.336660 -0.641753 -0.232386 -0.229672 0.119630 0.292530 -0.308714 -0.320514 -0.386351 -0.372975 0.331940 0.194890 0.203577 0.260687 0.201148 0.261075 0.226225 0.172862 0.168280 0.217207 0.194184 0.197922 0.224325 0.231166 0.231949 0.274639 0.226830 0.237926 0.233922 0.233328 0.273740 0.224113 0.225112 0.258708 0.283231 0.259602 0.260172
chargesum: 0.00000
title: Mulliken charges with hydrogens summed into heavy atoms:
elementType: F O O N N N C C C C C C C C C C C C C C C C C C C C C C C
charge: -0.198793 -0.270843 -0.227465 -0.075289 -0.257725 -0.225053 0.159281 0.019058 0.024160 0.019622 0.006485 0.042755 0.273642 0.165728 0.008649 0.245882 -0.113256 -0.001770 -0.098735 0.099237 -0.008272 -0.004560 0.119630 0.292530 -0.050006 -0.037283 -0.126748 -0.112803 0.331940
polarizability: 3.56484561e+02 -2.82728939e+01 2.90036106e+02 -6.58385923e-01 1.91630115e+01 1.85059550e+02
1716.lowfreq: -12.8783 -7.7058 -3.7748 -0.0007 -0.0003 0.0006 6.8259 10.9483 15.4713
frequency: -0.7164 9.3763 15.4470 25.9683 37.1556 45.4207 58.4514 90.0575 96.3920 121.9706 136.0657 138.1549 151.5458 159.9543 176.6959 186.3979 221.1982 228.1302 236.0933 240.5030 265.1610 283.9956 285.8046 318.4758 328.8734 342.0785 350.9048 373.9712 390.2992 410.6382 435.2969 438.4314 463.1026 475.1540 482.0534 489.8913 501.1261 534.7674 555.9388 565.8949 577.3982 582.2487 624.9657 641.0089 671.0805 704.3859 707.6247 716.3508 727.5566 741.9098 743.3721 755.1035 792.8376 812.2953 814.5495 821.8598 838.5977 841.0040 848.7874 865.3748 882.3363 912.5344 932.8738 938.6599 946.1550 959.9889 962.8734 982.0274 986.4301 989.4993 997.6466 1007.3062 1017.4206 1033.0234 1046.9330 1065.3147 1076.3953 1097.3415 1104.0905 1111.9828 1117.1135 1126.8895 1129.2306 1129.6248 1136.3965 1150.2074 1155.5519 1169.8508 1191.7115 1193.9614 1200.6457 1207.2397 1235.9521 1246.0131 1259.8006 1271.9611 1274.9620 1286.9525 1292.7314 1302.4471 1304.8544 1311.9989 1329.2590 1334.1064 1337.2971 1344.6479 1357.8116 1367.5176 1369.7178 1380.5897 1383.2694 1391.5874 1409.4617 1419.9665 1433.5638 1438.8940 1455.6542 1460.9931 1462.7399 1466.1264 1468.1789 1470.3188 1478.6591 1481.1324 1487.3399 1491.0035 1499.4023 1569.8578 1600.8508 1608.7830 1612.1530 1626.9938 1654.6807 2806.9875 2816.9617 2850.8149 2960.1702 2979.7436 2990.3639 3000.3814 3003.4769 3004.9690 3005.4578 3011.3664 3029.0066 3045.8606 3061.5271 3064.7293 3074.1126 3080.1501 3105.3425 3133.9158 3144.5815 3156.0693 3156.3080 3156.3644 3170.8735 3177.2399 3180.4183
redmass: 5.3148 6.6497 5.6996 4.3193 5.0742 5.4121 3.3142 5.3192 5.4160 4.0613 3.3448 3.4403 3.9795 1.1861 3.0393 4.2209 2.4584 3.6106 3.5990 2.3221 3.7447 3.1931 6.1822 4.9607 3.7383 6.1058 2.0040 6.6917 4.5934 2.9426 3.2805 2.6584 4.6546 3.1999 3.2023 3.2992 6.7863 2.8559 5.0477 2.1479 4.0339 6.4714 7.1839 4.4971 5.0244 7.0255 4.5468 2.4809 3.0570 3.9266 1.3798 5.2181 1.8698 4.3136 1.4989 1.3343 2.2407 1.4146 1.6922 3.9056 2.0205 1.3834 1.8445 2.9877 2.2747 1.4967 1.2956 1.5324 1.9462 1.7230 3.8956 2.4308 2.0094 3.1092 2.2655 2.0495 2.8870 2.2136 1.3648 2.5490 2.5596 1.6659 1.4376 1.3613 2.0226 1.4212 1.4254 1.1358 2.1255 1.9115 2.1265 1.9159 1.5027 2.3741 1.5735 1.2046 1.4736 1.4170 1.2854 1.3584 1.5231 1.5435 1.3579 1.4641 1.4333 3.3865 1.6612 1.8809 2.5825 5.8668 1.4952 1.4314 4.0575 3.6771 1.3211 1.1049 1.0862 1.0861 2.3136 1.0949 1.1126 1.0826 1.0986 1.0427 1.1408 2.5797 4.4563 8.0105 7.2195 7.3381 7.1374 7.8787 10.1784 1.0720 1.0706 1.0701 1.0604 1.0344 1.0833 1.0856 1.0613 1.0916 1.0632 1.0685 1.0859 1.0876 1.1023 1.1000 1.1025 1.1018 1.0990 1.0851 1.0896 1.0889 1.0888 1.0951 1.1003 1.0964 1.0974
irintensity: 0.4724 0.1171 0.7463 0.4302 0.1908 0.5315 1.9293 3.5829 0.5479 0.3064 0.6523 3.4769 4.4335 0.2745 0.6359 2.4281 0.6706 7.8012 6.3465 0.6258 8.7621 1.7333 0.5494 0.8045 1.5548 6.2571 5.8892 3.4500 1.2768 0.0517 4.6419 0.3097 4.6605 4.0151 4.3164 2.5797 3.3667 23.8025 17.9598 10.5344 0.8404 25.9196 0.3237 5.4999 13.3496 0.1053 4.1861 7.3720 10.4954 6.8011 107.5338 1.2831 25.7619 20.5433 1.4378 5.2660 15.1977 0.3167 48.5426 5.0515 18.7733 2.5966 8.5437 23.6575 4.8623 6.6750 0.0406 4.4925 9.2026 6.3268 37.0002 0.6601 22.6397 20.4511 7.0636 7.5456 29.2822 2.5479 10.0826 24.8821 17.0506 9.3893 22.1406 10.5419 21.7230 8.5490 83.8333 4.3021 29.1504 26.4240 9.8574 39.5944 93.2352 29.8043 41.9961 1.3552 62.2838 33.8322 3.0801 9.8590 21.0996 76.7892 40.7377 47.1198 2.2803 78.3227 58.4925 47.3741 60.0900 18.9984 2.8803 1.0288 18.2585 19.0848 24.9020 18.8231 8.5841 3.9261 12.4561 3.9906 2.2031 23.4094 11.3880 16.7644 22.5600 27.4070 152.3396 112.4674 71.5590 66.1493 61.1396 31.4888 475.7852 42.8642 132.1198 193.7610 52.6922 61.0888 13.0328 21.8101 24.7654 12.6021 17.9896 22.9688 50.3936 29.4130 28.1403 47.7539 5.9229 29.3154 0.7326 0.6587 13.2336 2.0449 3.5065 26.9760 17.6070 4.7466 3.9386
temp: 298.150 k
press: 1.00000 atm
elementType: 9 8 8 7 7 7 6 6 6 6 6 6 6 6 6 6 6 6 6 6 6 6 6 6 6 6 6 6 6 1 1 1 1 1 1 1 1 1 1 1 1 1 1 1 1 1 1 1 1 1 1 1 1 1 1
symmnumber: 1
zpe: 1175940.1 jmol-1
zpe.correction: 0.447892 hartree
zpe.thermalcorrener: 0.473441 hartree
zpe.thermalcorrenthalpy: 0.474385 hartree
zpe.thermalcorrgfe: 0.389454 hartree
zpe.sumelectzpe: -1304.503534 hartree
zpe.sumelectthermal: -1304.477985 hartree
zpe.sumelectthermalent: -1304.477040 hartree
zpe.sumelectthermalfe: -1304.561972 hartree
dipole: 4.3220 -0.9869 1.4893
dipole: 4.6767
quadrupole: -169.5432 -164.7646 -171.6805
quadrupole: 5.7867 -6.6024 -6.0271
quadrupole: -0.8804 3.8982 -3.0178 5.7867 -6.6024 -6.0271
hfenergy: -1304.9514257 hartree
pointgroup: C01 [X(C23H26F1N3O2)]
dipole: -1.6921611 0.4948806 0.5264854 debye
polarizability: 354.8151137|-29.7147795|286.4427699|4.2908408|-30.1219956|190.3223335 unknown
InChI: InChI=1S/C23H26FN3O2/c1-25-20-5-2-3-6-21(20)27(23(25)29)19-12-15-26(16-13-19)14-4-7-22(28)17-8-10-18(24)11-9-17/h2-3,5-6,8-11,19H,4,7,12-16H2,1H3
charge 0 multiplicity 1
55 atoms
F  7.168491 -3.675247 0.783079
O  -1.794432 -1.768485 0.707565
O  4.822128 1.755764 -1.686402
N  0.345556 2.320489 0.407973
N  -3.294766 0.018526 0.095575
N  -4.13234 -2.072326 0.271018
C  -2.33608 1.145728 0.0911
C  -1.226375 0.954489 -0.969936
C  -1.700896 1.37422 1.483614
C  -0.247897 2.145955 -0.940853
C  -0.709988 2.554203 1.423574
C  1.402812 3.364177 0.450083
C  -4.671255 0.090616 -0.205811
C  -2.934073 -1.319539 0.394836
C  2.681896 2.967506 -0.31698
C  -5.198427 -1.234379 -0.093591
C  -5.500651 1.168409 -0.562654
C  3.25923 1.631382 0.180272
C  -6.555942 -1.507617 -0.333586
C  -4.183254 -3.512807 0.497093
C  -6.870928 0.894458 -0.805329
C  -7.390444 -0.419298 -0.693304
C  4.431617 1.126811 -0.656449
C  5.125521 -0.143226 -0.241724
C  4.683893 -0.938219 0.85112
C  6.264923 -0.559878 -0.984357
C  5.361946 -2.124706 1.199881
C  6.957363 -1.738166 -0.650419
C  6.485324 -2.494081 0.439317
H  -2.923629 2.047049 -0.176047
H  -1.675682 0.866575 -1.977154
H  -0.680791 0.020168 -0.750071
H  -2.489442 1.58504 2.23071
H  -1.167728 0.456829 1.788068
H  0.56094 1.969083 -1.670819
H  -0.782727 3.080728 -1.263445
H  -1.274849 3.502231 1.208304
H  -0.226182 2.680508 2.409782
H  1.028546 4.343606 0.054307
H  1.657774 3.527026 1.51629
H  3.430854 3.773126 -0.19838
H  2.492997 2.902645 -1.403664
H  -5.113374 2.188149 -0.654023
H  2.446709 0.874899 0.189669
H  3.582841 1.720997 1.238321
H  -6.957395 -2.522322 -0.247404
H  -4.508308 -4.046768 -0.414635
H  -4.871862 -3.761489 1.325289
H  -3.16596 -3.842978 0.763503
H  -7.538104 1.716587 -1.08524
H  -8.453124 -0.598512 -0.887715
H  3.803893 -0.643509 1.430682
H  6.586124 0.063898 -1.82464
H  5.034721 -2.753202 2.03283
H  7.836206 -2.072526 -1.208924
