program: Gaussian 09
title: 000131584
version: EM64L-G09RevD.01
frameworkgroup: C1[X(C16H22N4O3)]
method: RPBEPBE
basis: SDD
operation: Freq
keyword: #p
keyword: freq=noraman
keyword: PBEPBE/SDD
title: #p freq=noraman PBEPBE/SDD
converged: YES YES NO NO
title: Mulliken charges:
elementType: O O O N N N N C C C C C C C C C C C C C C C C H H H H H H H H H H H H H H H H H H H H H H
charge: -0.183941 -0.261865 -0.261998 -0.415363 -0.183339 -0.085152 -0.231123 -0.249168 -0.437922 -0.519506 -0.518242 0.236924 0.151752 0.085669 0.060640 0.106219 -0.325327 0.194247 -0.303940 -0.359207 -0.360136 -0.685357 -0.690149 0.236010 0.237768 0.228818 0.256055 0.264314 0.273437 0.254980 0.335447 0.225637 0.241999 0.238368 0.238662 0.226901 0.220967 0.221652 0.229038 0.216455 0.215202 0.223386 0.216080 0.214639 0.220471
chargesum: 0.00000
title: Mulliken charges with hydrogens summed into heavy atoms:
elementType: O O O N N N N C C C C C C C C C C C C C C C C
charge: -0.183941 -0.261865 -0.261998 -0.079916 -0.183339 -0.085152 -0.231123 -0.013157 0.028664 0.000862 0.010175 0.236924 0.151752 0.085669 0.060640 0.106219 0.142309 0.194247 0.173090 0.088661 0.090553 -0.030314 -0.038960
polarizability: 2.77828578e+02 6.81864821e+00 2.17603656e+02 3.46004316e+00 -5.69861500e+00 1.40868730e+02
1716.lowfreq: -5.8593 -3.1233 -0.0008 0.0001 0.0002 9.3924 13.9097 24.4529 37.2320
frequency: 12.9483 24.4525 37.1934 37.8320 49.1196 60.0574 75.2208 80.6740 84.4341 115.0679 131.9234 153.6482 162.0876 186.2144 222.0980 227.6086 229.4177 253.9738 269.3624 283.1625 297.7119 335.3128 349.6078 378.3570 388.8304 402.0767 410.7992 443.2396 458.3909 491.0040 541.8331 562.3598 574.9174 651.8156 661.1560 670.7872 673.8362 705.3394 708.7940 727.9998 729.8228 743.8561 745.6673 774.5984 780.0469 812.7442 857.0878 879.0157 886.8276 892.0213 897.6996 905.6473 949.2040 955.0936 986.9065 998.8030 1002.3285 1051.0992 1052.0493 1060.0941 1069.2859 1109.1559 1114.4265 1115.7036 1129.6172 1142.5175 1153.0423 1170.3335 1177.2670 1184.6174 1193.5745 1236.0244 1237.7578 1258.7001 1264.1798 1270.1253 1274.0023 1282.2065 1304.8026 1306.1102 1307.6638 1312.3576 1326.6930 1332.9153 1363.0374 1369.5884 1386.9006 1391.4426 1394.3845 1400.6210 1421.0427 1428.3767 1439.1926 1448.8987 1465.0739 1473.6344 1474.3598 1475.2461 1478.8751 1481.1623 1485.2878 1485.4667 1522.3476 1572.2555 1611.4478 1652.3934 1668.4128 2977.1347 2979.0521 2995.8997 2996.8417 3000.8461 3004.7692 3010.3669 3029.5294 3030.0572 3035.1134 3045.4044 3046.0879 3075.3717 3076.0482 3077.6888 3079.7602 3082.4906 3088.9786 3089.8179 3101.8581 3106.3544 3582.4945
redmass: 4.9888 3.5317 3.6647 5.2162 4.7331 5.4393 2.2666 2.8452 1.6870 4.3821 4.9133 5.3048 3.6523 4.6695 1.1847 1.1425 2.3087 3.7538 3.1238 3.7338 2.4433 4.6194 3.0036 6.6814 5.8468 5.0088 6.0452 2.5687 4.1716 6.6424 5.7266 5.5527 3.6230 3.3392 3.8265 4.1429 1.5359 3.5530 4.3391 1.7042 6.9307 9.5483 1.1330 2.3686 2.8946 2.5647 1.3636 1.8800 1.5919 1.7753 2.4535 1.7445 2.8782 2.5604 2.9415 2.5744 2.2489 3.0675 2.9712 2.3846 2.9650 3.3937 2.2511 2.3072 1.5028 1.4866 2.6723 1.4372 1.9817 1.9964 2.1780 1.5276 2.9984 2.7945 1.4058 1.5647 1.4631 1.4571 1.3375 1.4035 1.4187 1.3022 1.8731 1.2811 1.3925 1.4406 3.6957 1.2265 1.2121 2.2513 1.1175 1.1162 1.1446 1.1227 1.9299 1.0623 1.0750 1.6645 1.0488 1.0543 1.0740 1.0732 4.6426 8.9521 10.2496 10.4983 12.1206 1.0357 1.0358 1.0596 1.0597 1.0665 1.0643 1.0630 1.0838 1.0592 1.0585 1.1008 1.1012 1.1019 1.1017 1.0997 1.0989 1.0989 1.0991 1.0995 1.1064 1.1067 1.0820
irintensity: 1.4696 0.7219 1.1025 1.6311 2.7289 0.3928 0.2420 0.3691 0.0254 1.2546 0.0520 4.3127 5.3181 9.2582 0.0243 0.2119 2.2930 8.1692 3.0079 3.7258 7.9028 7.2803 7.6836 14.5416 5.6199 1.5522 0.9160 0.5154 2.8754 10.4173 17.4463 3.3097 10.8426 14.5825 1.1108 7.6371 80.0664 6.3594 5.7657 2.1278 1.8932 11.8950 13.2512 5.3864 3.7892 3.1742 0.1022 3.5235 8.4250 8.8848 9.3065 21.1798 8.3008 6.0927 2.0282 12.5085 15.4322 4.8398 9.3590 1.1504 28.2064 8.2581 8.3787 10.1870 19.1942 19.6941 58.0761 4.4266 9.5789 39.9168 1.0669 8.9770 66.9209 48.2593 7.5864 17.8934 2.9004 7.9844 1.2960 1.3903 2.8639 22.7375 125.2314 15.9415 4.2391 11.8144 8.4516 10.8154 13.9007 43.2000 34.8857 12.4048 22.9550 31.1111 97.9920 2.4711 8.7249 169.8658 8.6686 3.2469 9.6816 22.4118 39.3981 7.2115 508.5138 541.6721 166.5992 43.1225 33.7926 11.4430 15.6977 13.0937 26.6161 9.1053 36.4395 24.8451 26.6538 0.8302 0.1056 37.5419 41.6243 14.0553 40.5771 39.2349 9.6891 22.7397 15.0386 8.3571 79.0540
temp: 298.150 k
press: 1.00000 atm
elementType: 8 8 8 7 7 7 7 6 6 6 6 6 6 6 6 6 6 6 6 6 6 6 6 1 1 1 1 1 1 1 1 1 1 1 1 1 1 1 1 1 1 1 1 1 1
symmnumber: 1
zpe: 967574.2 jmol-1
zpe.correction: 0.368530 hartree
zpe.thermalcorrener: 0.391283 hartree
zpe.thermalcorrenthalpy: 0.392228 hartree
zpe.thermalcorrgfe: 0.313353 hartree
zpe.sumelectzpe: -1065.911362 hartree
zpe.sumelectthermal: -1065.888608 hartree
zpe.sumelectthermalent: -1065.887664 hartree
zpe.sumelectthermalfe: -1065.966539 hartree
dipole: 2.0478 -3.3906 -0.1899
dipole: 3.9656
quadrupole: -150.1669 -137.5168 -134.2702
quadrupole: -20.4846 -7.6006 -1.6675
quadrupole: -9.5156 3.1345 6.3811 -20.4846 -7.6006 -1.6675
hfenergy: -1066.2798918 hartree
pointgroup: C01 [X(C16H22N4O3)]
dipole: -0.8233474 -1.3166945 0.1502026 debye
polarizability: 277.7048478|-7.5468165|218.1757898|0.7840477|2.4784052|140.4203269 unknown
InChI: InChI=1S/C16H22N4O3/c1-3-7-19-14-12(15(22)20(8-4-2)16(19)23)17-13(18-14)10-5-6-11(21)9-10/h10,17H,3-9H2,1-2H3
charge 0 multiplicity 1
45 atoms
O  -5.319218 1.226395 -0.743458
O  2.359373 -2.806422 0.000881
O  3.069435 1.81817 0.689069
N  -0.657903 -2.072485 -0.085099
N  0.856557 1.087355 0.477065
N  -1.388047 0.06356 0.164844
N  2.699512 -0.483418 0.367366
C  -3.179052 -1.712298 -0.197693
C  -3.984473 -1.588615 1.151493
C  -3.99157 -0.822516 -1.18125
C  -4.493732 -0.130121 1.171072
C  -1.762256 -1.232233 -0.045933
C  -4.688499 0.237799 -0.306083
C  -0.001231 0.020537 0.261028
C  0.482564 -1.286489 0.111219
C  1.87589 -1.640028 0.144193
C  0.340965 2.474328 0.603337
C  2.255469 0.865767 0.51828
C  4.173154 -0.699147 0.400712
C  0.228832 3.191583 -0.760256
C  4.824219 -0.506119 -0.986704
C  -0.322768 4.62259 -0.591024
C  6.34697 -0.748215 -0.924362
H  -3.154506 -2.765475 -0.532851
H  -3.366572 -1.84464 2.028308
H  -4.836569 -2.293493 1.120074
H  -4.776507 -1.417709 -1.687958
H  -3.385534 -0.33816 -1.96402
H  -3.721374 0.551815 1.575516
H  -5.420887 0.028104 1.746607
H  -0.64797 -3.081484 -0.235074
H  -0.650346 2.411652 1.084925
H  1.036969 3.020386 1.262097
H  4.597885 0.018016 1.122556
H  4.334408 -1.73104 0.755479
H  1.229161 3.223775 -1.230976
H  -0.436629 2.607602 -1.423881
H  4.359487 -1.208795 -1.703846
H  4.619381 0.521639 -1.339707
H  -1.331431 4.611134 -0.137157
H  0.336382 5.231466 0.05559
H  -0.400306 5.132755 -1.567436
H  6.835143 -0.040417 -0.228545
H  6.574172 -1.77501 -0.581155
H  6.809652 -0.615299 -1.918643
