program: Gaussian 09
title: 000131583
version: EM64L-G09RevD.01
frameworkgroup: C1[X(C14H9NO2S)]
method: RPBEPBE
basis: SDD
operation: Freq
keyword: #p
keyword: freq=noraman
keyword: PBEPBE/SDD
title: #p freq=noraman PBEPBE/SDD
converged: YES YES NO NO
title: Mulliken charges:
elementType: S O O N C C C C C C C C C C C C C C H H H H H H H H H
charge: 0.214692 -0.224532 -0.155019 -0.419175 0.647562 0.326608 -0.443840 -0.391810 -0.361895 -0.360285 -0.000946 0.291169 -0.099261 -0.367271 -0.357115 -0.236886 -0.230772 -0.228309 0.287731 0.243979 0.279585 0.344519 0.265767 0.271859 0.234044 0.234523 0.235077
chargesum: 0.00000
title: Mulliken charges with hydrogens summed into heavy atoms:
elementType: S O O N C C C C C C C C C C C C C C
charge: 0.214692 -0.224532 -0.155019 -0.074655 0.647562 0.326608 -0.443840 -0.104079 -0.117916 -0.080700 -0.000946 0.291169 -0.099261 -0.101503 -0.085256 -0.002843 0.003751 0.006768
polarizability: 2.93812308e+02 -2.21111747e-03 1.84363279e+02 1.67087199e+01 -1.85886873e+00 9.06504964e+01
1716.lowfreq: -2.9902 0.0009 0.0020 0.0023 4.1478 5.8156 39.7886 51.4749 55.6075
frequency: 39.7359 51.4700 55.6001 92.6965 141.5859 167.8833 183.9144 223.9967 245.7741 302.9317 323.4370 358.4716 401.6489 406.8466 434.0459 437.7907 482.3245 512.7498 530.5448 559.9294 579.9390 588.2279 614.4999 651.1427 662.5843 683.5630 696.7870 710.1987 744.9895 757.9299 800.1342 842.2233 862.1534 872.9569 910.8552 932.0957 949.5300 974.3348 988.8793 991.0522 1005.7873 1027.1782 1044.8833 1084.7584 1119.3675 1147.0602 1157.5541 1175.2587 1189.0699 1256.6538 1263.6816 1296.0563 1318.0501 1341.8875 1383.4882 1415.4047 1424.2318 1433.6982 1476.0657 1483.9354 1534.0909 1583.6990 1591.1753 1606.0171 1610.0472 1694.8839 3129.8662 3138.9588 3145.5837 3150.0533 3159.1063 3163.7223 3169.8292 3170.4660 3559.8100
redmass: 6.3552 6.1623 5.6455 7.9239 7.7106 6.6562 5.5037 5.9177 6.6571 8.9146 6.8368 8.4336 5.3583 3.1894 6.0151 3.3877 7.9428 6.5162 6.2619 2.5685 6.5774 4.4045 6.4491 6.3834 1.8294 6.4891 3.5490 1.8312 3.4364 5.3361 2.3604 1.6097 1.2534 4.9692 1.5241 3.6471 1.5423 1.3951 3.7351 1.6076 1.3333 2.1670 2.8676 1.5828 4.7656 1.5147 2.8250 1.0572 1.1246 1.4061 1.8859 3.4814 1.3856 2.8226 8.5205 4.9264 2.7665 2.2757 2.3765 3.2760 9.9588 6.0456 6.6123 6.5109 6.6543 10.2620 1.0851 1.0881 1.0894 1.0925 1.0961 1.0925 1.0975 1.1000 1.0786
irintensity: 2.6610 0.9459 2.5559 2.4807 0.9292 2.5193 1.6989 1.5538 0.4199 3.1515 5.4356 2.3427 3.7071 2.6897 2.4377 8.4174 6.4105 3.2448 14.0395 20.8653 39.3227 11.3119 0.2987 31.7319 79.1165 9.5300 6.9320 81.7794 23.1348 21.7451 15.7251 47.6299 4.4751 9.3010 16.0957 27.2344 5.1642 4.9884 4.6165 1.3152 0.7517 4.1727 0.5869 11.8130 41.9139 60.2735 35.6302 0.4209 24.9216 57.5653 96.6870 363.7602 27.5418 20.0312 1.6622 12.2020 22.7324 19.7031 18.5252 19.8169 169.4661 2.7017 18.2506 90.5228 5.2963 807.6100 0.5065 4.6089 5.8951 18.8483 17.7768 0.9392 18.7441 8.9746 68.9932
temp: 298.150 k
press: 1.00000 atm
elementType: 16 8 8 7 6 6 6 6 6 6 6 6 6 6 6 6 6 6 1 1 1 1 1 1 1 1 1
symmnumber: 1
zpe: 509721.8 jmol-1
zpe.correction: 0.194143 hartree
zpe.thermalcorrener: 0.208423 hartree
zpe.thermalcorrenthalpy: 0.209368 hartree
zpe.thermalcorrgfe: 0.151722 hartree
zpe.sumelectzpe: -1140.953393 hartree
zpe.sumelectthermal: -1140.939112 hartree
zpe.sumelectthermalent: -1140.938168 hartree
zpe.sumelectthermalfe: -1140.995814 hartree
dipole: -1.3246 0.1742 1.4322
dipole: 1.9586
quadrupole: -114.2248 -111.1522 -110.6816
quadrupole: 28.6429 5.6724 1.2806
quadrupole: -2.2053 0.8674 1.3379 28.6429 5.6724 1.2806
hfenergy: -1141.1475356 hartree
pointgroup: C01 [X(C14H9N1O2S1)]
dipole: 0.5234617 -0.1588214 -0.5427305 debye
polarizability: 293.3995775|10.9306641|169.6492637|15.1784614|-34.2457083|105.7772425 unknown
InChI: InChI=1S/C14H9NO2S/c16-13(9-4-2-1-3-5-9)10-6-7-11-12(8-10)18-14(17)15-11/h1-8,15H
charge 0 multiplicity 1
27 atoms
S  -2.811855 -1.58542 1.154714
O  1.971519 2.381676 -0.758449
O  -5.54061 -1.385198 0.537188
N  -4.024084 0.099653 -0.516055
C  -2.667573 0.447224 -0.601951
C  0.121766 0.869482 -0.526823
C  -1.838806 -0.358555 0.227592
C  -0.451282 -0.159644 0.271178
C  -2.108631 1.477653 -1.391446
C  -0.71972 1.68375 -1.33736
C  1.587666 1.198302 -0.490116
C  2.601268 0.144915 -0.140541
C  -4.393802 -0.945622 0.339453
C  2.421344 -1.229852 -0.454884
C  3.822794 0.565945 0.452395
C  3.440265 -2.16463 -0.168442
C  4.830948 -0.370424 0.753305
C  4.641637 -1.73992 0.444697
H  0.177194 -0.761801 0.933121
H  -2.743729 2.103816 -2.026733
H  -0.251494 2.486593 -1.915032
H  -4.756948 0.577045 -1.044262
H  1.506638 -1.562195 -0.956941
H  3.959077 1.63236 0.660286
H  3.300357 -3.21946 -0.42864
H  5.763766 -0.038381 1.221719
H  5.428195 -2.467913 0.672628
