program: Gaussian 09
title: 000131582
version: EM64L-G09RevD.01
frameworkgroup: C1[X(C22H21NO5S)]
method: RPBEPBE
basis: SDD
operation: Freq
keyword: #p
keyword: freq=noraman
keyword: PBEPBE/SDD
title: #p freq=noraman PBEPBE/SDD
converged: YES YES NO NO
title: Mulliken charges:
elementType: S O O O O O N C C C C C C C C C C C C C C C C C C C C C C H H H H H H H H H H H H H H H H H H H H H
charge: 0.942158 -0.363222 -0.187256 -0.243710 -0.500385 -0.483138 -0.129778 -0.424555 -0.380111 0.356893 0.131058 -0.165104 -0.564552 0.516775 0.342777 0.145610 -0.694305 -0.692308 -0.744852 0.094912 0.203254 -0.401031 -0.397959 -0.068878 -0.397066 -0.246238 -0.285603 -0.332932 -0.206524 0.249461 0.249293 0.254479 0.252405 0.262902 0.212286 0.218028 0.225470 0.219337 0.212037 0.225782 0.221551 0.218394 0.217934 0.242998 0.261656 0.291876 0.339104 0.289008 0.268313 0.243763
chargesum: 0.00000
title: Mulliken charges with hydrogens summed into heavy atoms:
elementType: S O O O O O N C C C C C C C C C C C C C C C C C C C C C C
charge: 0.942158 -0.363222 -0.187256 -0.243710 -0.500385 -0.483138 -0.129778 0.074198 0.126773 0.356893 0.131058 -0.165104 -0.301650 0.516775 0.342777 0.145610 -0.038522 -0.035153 -0.086973 0.094912 0.203254 -0.158033 -0.136303 -0.068878 -0.105190 0.092866 0.003405 -0.064620 0.037239
polarizability: 5.31045910e+02 -1.44092948e+01 3.25450633e+02 5.84068112e+00 6.30824666e+00 1.74739743e+02
1716.lowfreq: -6.6418 -4.8681 -2.7759 -0.0018 -0.0017 0.0000 14.4044 21.7911 27.4028
frequency: 13.7813 21.4268 27.2749 37.1327 49.8487 51.6488 60.6488 79.0457 87.6642 102.0611 119.4695 125.2890 140.9332 155.8520 177.2557 180.6799 198.7986 202.2099 207.9438 216.7040 234.3300 254.1439 266.5622 303.6512 308.5874 311.3795 323.3285 334.2916 352.8309 358.8855 366.9177 381.8584 387.6313 408.9564 419.2248 427.8568 439.3036 442.9188 456.5081 463.2654 469.2141 488.0675 549.5089 555.8354 565.6887 591.6282 619.4736 634.5785 663.2966 677.4864 708.8514 731.7305 755.3996 785.0190 791.0006 793.8231 796.4128 827.4871 831.1235 847.4503 852.4009 862.3092 883.8298 900.7220 920.9227 929.1658 931.9441 945.5745 947.1910 955.9325 975.3958 984.1795 995.1969 995.9507 1007.3075 1009.5818 1020.2648 1026.4123 1051.3081 1052.1563 1094.7041 1104.6602 1110.2409 1113.1006 1119.1271 1127.9440 1134.8502 1145.1424 1179.6013 1202.4243 1203.0940 1204.1997 1216.6661 1247.2596 1271.1878 1275.2846 1310.5275 1329.5221 1375.1522 1378.2252 1378.3038 1378.6062 1395.1104 1406.6097 1419.3054 1425.1499 1433.5668 1460.1334 1460.6690 1464.2172 1466.2010 1474.5198 1480.9869 1483.1052 1487.5370 1498.1103 1522.0157 1545.0012 1565.4706 1581.8469 1583.5436 1584.1938 1619.8340 2974.6977 2976.4697 2980.8396 3069.6153 3071.0404 3071.7480 3072.5110 3080.0997 3080.5310 3083.4151 3090.9189 3139.8870 3146.7580 3150.1342 3154.8201 3157.2814 3163.8029 3177.1856 3177.3321 3178.6610 3201.6394
redmass: 5.1655 5.8094 4.2926 5.7764 4.6614 5.5550 4.9496 5.0669 3.9675 7.2959 5.4534 6.1231 4.5538 4.4794 3.7946 4.2130 4.0044 1.8005 3.0639 4.8670 2.6426 1.1561 6.9161 3.3489 1.1309 4.7383 3.6112 6.6359 3.3256 3.8514 10.3889 5.4228 4.5709 2.9829 7.4335 5.7917 6.2136 6.1419 4.0868 4.6335 4.3357 7.2747 3.0345 3.6946 6.6931 5.9174 7.1191 6.1231 3.3584 6.0403 5.7803 3.2814 4.4666 3.0326 2.3804 1.3864 2.7512 5.8525 3.5646 1.3306 2.0313 1.4636 2.2459 6.2154 1.7311 6.1970 1.6223 1.2205 17.2110 1.4306 1.3197 5.3176 1.3192 1.2158 1.3793 2.8459 1.4073 1.3880 3.0224 3.2032 1.3513 2.2187 1.5784 1.4057 1.5433 1.4568 1.4456 2.5419 1.3051 1.5751 2.0621 2.3622 2.6512 2.2602 3.0727 4.0048 1.2812 2.8258 3.1400 2.0748 4.0238 1.2340 2.6864 1.2015 3.4633 2.9098 3.4209 1.0509 1.0837 1.2198 1.0798 1.3035 1.3530 1.2114 1.0503 1.0797 8.4426 8.7042 7.3965 7.0588 7.1594 5.7797 8.3796 1.0352 1.0347 1.0358 1.0527 1.1005 1.0999 1.1002 1.0995 1.0989 1.0994 1.0568 1.0891 1.0872 1.0913 1.0974 1.0887 1.0925 1.0955 1.0991 1.1174 1.1179
irintensity: 1.3521 1.0157 0.4520 0.4282 2.4936 0.1423 5.7381 1.4027 3.8099 2.2100 1.5550 4.4948 0.0786 3.3838 4.7097 3.8757 25.6734 6.0488 0.1029 3.8294 2.8289 0.4786 1.8208 1.4492 3.1266 23.8864 9.1012 5.5599 13.4265 7.8288 16.2051 2.4623 14.9893 1.0840 2.8219 20.0686 72.6544 9.4417 17.8473 41.1296 3.8166 16.3816 28.4233 27.2881 13.3394 6.6431 5.0921 18.8924 6.5864 0.5318 6.6385 2.3053 6.9519 4.5501 10.5392 43.2679 42.2333 54.7117 39.3910 15.7806 6.2849 27.6762 35.8801 64.7696 4.6113 5.8769 2.7350 0.6643 70.2954 0.7666 0.3912 6.0511 3.6153 5.5934 1.3714 31.0683 1.4219 0.5972 30.6512 21.9285 4.8657 28.7552 41.6262 26.1399 18.2173 4.3901 1.9776 33.0287 8.2315 24.2598 18.1084 3.1158 1.6667 45.9251 46.4160 370.4751 3.5607 29.3961 0.2438 35.7909 3.2833 17.4424 31.7031 13.7347 20.5469 56.3441 30.3954 0.2786 13.3351 15.3817 4.2196 21.8156 65.8919 8.7332 12.9707 38.8532 23.2516 333.3009 27.6598 155.6217 11.9902 19.8911 410.8596 27.2908 29.9592 33.5896 24.3796 12.3319 4.4267 8.5658 52.9267 113.3450 46.0626 34.4797 52.2512 8.5670 8.6236 84.8348 2.9636 1.6323 15.8017 9.8892 4.8353 19.5871
temp: 298.150 k
press: 1.00000 atm
elementType: 16 8 8 8 8 8 7 6 6 6 6 6 6 6 6 6 6 6 6 6 6 6 6 6 6 6 6 6 6 1 1 1 1 1 1 1 1 1 1 1 1 1 1 1 1 1 1 1 1 1
symmnumber: 1
zpe: 992214.2 jmol-1
zpe.correction: 0.377914 hartree
zpe.thermalcorrener: 0.406120 hartree
zpe.thermalcorrenthalpy: 0.407064 hartree
zpe.thermalcorrgfe: 0.317145 hartree
zpe.sumelectzpe: -1677.568195 hartree
zpe.sumelectthermal: -1677.539989 hartree
zpe.sumelectthermalent: -1677.539045 hartree
zpe.sumelectthermalfe: -1677.628965 hartree
dipole: 1.1978 3.8282 -0.6788
dipole: 4.0683
quadrupole: -134.8735 -159.0414 -185.0181
quadrupole: -6.1081 -7.7662 10.1510
quadrupole: 24.7709 0.6029 -25.3738 -6.1081 -7.7662 10.1510
hfenergy: -1677.9461091 hartree
pointgroup: C01 [X(C22H21N1O5S1)]
dipole: 0.4731487 -1.5152204 0.2052126 debye
polarizability: 530.827756|15.3682962|324.5771177|6.6174462|14.489201|175.8314118 unknown
InChI: InChI=1S/C22H21NO5S/c1-22(2,3)14-7-9-15(10-8-14)29(26,27)28-19-6-4-5-16-20(19)18(24)13-17(21(16)25)23-11-12-23/h4-10,13H,11-12H2,1-3H3
charge 0 multiplicity 1
50 atoms
S  1.093817 1.719201 -0.903468
O  0.15506 1.532223 0.871683
O  -5.769531 0.078415 0.118711
O  -0.417377 -1.172819 0.325949
O  1.441201 3.287789 -1.14123
O  0.190757 0.943265 -2.003206
N  -4.973649 -2.553977 -0.23953
C  -5.006738 -3.692062 -1.18001
C  -6.125242 -2.631465 -1.155905
C  -4.019217 -1.573963 -0.05804
C  6.33626 -1.294609 0.546907
C  -4.52761 -0.180437 0.187711
C  -2.660136 -1.835002 -0.009403
C  5.044885 -0.521302 0.194039
C  -3.512837 0.875055 0.493987
C  -2.110083 0.591981 0.512221
C  6.494434 -2.499513 -0.430108
C  6.229536 -1.824759 2.009675
C  7.605518 -0.411713 0.438999
C  -1.646136 -0.823152 0.275905
C  -1.216995 1.680102 0.794812
C  3.791281 -1.197296 0.227727
C  5.051927 0.854263 -0.157798
C  2.662589 0.810714 -0.436001
C  -4.003872 2.178371 0.75056
C  2.580956 -0.546072 -0.083227
C  3.858665 1.542412 -0.47195
C  -1.730482 2.987674 1.044011
C  -3.113902 3.235218 1.033542
H  -5.188847 -4.67758 -0.739871
H  -4.299273 -3.673277 -2.019412
H  -6.169398 -1.910966 -1.980055
H  -7.087461 -2.869411 -0.693416
H  -2.279929 -2.847608 -0.183331
H  7.408911 -3.06972 -0.181557
H  5.637765 -3.194239 -0.371002
H  6.576993 -2.152102 -1.476125
H  5.361021 -2.493992 2.142293
H  7.140286 -2.394645 2.271826
H  6.125636 -0.989094 2.725488
H  8.495758 -1.015567 0.691668
H  7.748627 -0.020383 -0.585284
H  7.574362 0.442775 1.140111
H  3.748498 -2.253932 0.511946
H  5.992686 1.409468 -0.191446
H  -5.086571 2.334556 0.71776
H  1.611901 -1.051642 -0.02281
H  3.858484 2.603961 -0.738062
H  -1.004727 3.782524 1.242756
H  -3.495101 4.24193 1.23126
