program: Gaussian 09
title: 000131576
version: EM64L-G09RevD.01
frameworkgroup: C1[X(C10H15NOS)]
method: RPBEPBE
basis: SDD
operation: Freq
keyword: #p
keyword: freq=noraman
keyword: PBEPBE/SDD
title: #p freq=noraman PBEPBE/SDD
converged: YES YES NO NO
title: Mulliken charges:
elementType: S O N C C C C C C C C C C H H H H H H H H H H H H H H H
charge: 0.153465 -0.309970 -0.684125 -0.619879 -0.330367 -0.239554 0.229146 -0.320771 0.307807 -0.229402 -0.368853 -0.671219 -0.530908 0.251786 0.247772 0.213420 0.211361 0.260881 0.244978 0.219671 0.210563 0.219906 0.209285 0.301503 0.335564 0.238585 0.226561 0.222797
chargesum: 0.00000
title: Mulliken charges with hydrogens summed into heavy atoms:
elementType: S O N C C C C C C C C C C
charge: 0.153465 -0.309970 -0.047059 -0.120322 0.094415 -0.239554 0.229146 -0.059891 0.307807 0.015576 -0.149182 -0.031466 0.157035
polarizability: 2.01906167e+02 2.97071711e+00 1.35866918e+02 -1.20419866e+01 -3.44023287e+00 9.31693017e+01
1716.lowfreq: -22.7964 -5.7257 -2.8974 -0.0014 0.0010 0.0012 15.0723 31.9684 47.6349
frequency: -5.8595 30.3139 47.6344 86.2034 95.6065 136.6172 166.2896 190.8917 216.8180 221.2207 259.0444 267.6662 309.1556 340.0781 344.8716 369.0043 398.0154 446.0026 484.2548 510.9513 514.7214 589.5600 637.3792 692.6300 723.6547 746.7643 769.2329 807.6889 850.6322 852.4612 857.0238 897.5110 927.3828 998.1505 1020.9977 1036.7017 1047.5060 1080.6753 1104.2968 1117.5575 1140.8271 1159.8475 1194.6698 1210.6232 1239.3893 1267.0014 1280.9674 1316.4693 1331.0742 1381.8273 1382.5705 1417.3628 1441.3843 1453.8823 1465.2899 1474.7181 1475.2978 1476.5966 1485.9676 1506.1350 1582.2964 1597.9122 1628.6367 2960.3539 2974.9391 2985.8998 3011.3687 3032.6569 3047.1969 3071.1831 3075.9497 3090.4690 3122.3282 3124.7526 3156.4664 3161.7584 3565.3920 3713.5930
redmass: 3.4461 1.7064 4.3311 2.6983 3.2078 4.8301 4.5112 2.1958 1.1393 2.3624 3.5515 1.9319 3.0924 3.7221 1.6030 2.6091 9.3000 2.7416 1.1038 3.5075 5.8028 4.3981 7.5482 4.9582 3.6937 1.0800 4.9529 1.4993 4.4820 1.2764 1.4214 1.9135 1.3341 6.4155 1.6460 1.1523 2.7772 2.0491 2.1650 1.2603 1.2694 1.4118 3.6109 1.4439 1.2286 1.3984 1.1058 2.5243 1.4530 3.7166 1.2079 4.9818 1.2418 1.0920 1.0494 1.0435 1.0510 1.0766 1.0809 3.3449 6.8780 1.9640 2.1003 1.0327 1.0349 1.0599 1.0563 1.1014 1.1039 1.1023 1.0994 1.1082 1.0997 1.0885 1.0945 1.0922 1.0443 1.1045
irintensity: 0.5858 0.0139 0.5711 1.2364 6.9556 3.6999 3.4583 0.0979 0.1622 2.0775 3.6294 1.9186 12.0847 0.9811 112.2685 95.7514 3.8613 5.8193 85.5675 6.1330 3.2407 16.9306 2.4893 3.0551 0.2162 9.4253 15.9035 45.8206 7.5666 3.9245 20.7802 9.2942 0.1126 43.8672 3.3594 0.6130 4.2333 6.9674 23.5885 0.1690 50.7504 7.4063 137.9399 0.0170 11.9781 4.9163 0.2645 74.7934 6.1365 6.9378 12.1373 3.4684 15.0970 4.5341 13.6422 12.5515 4.5530 53.2664 12.6182 191.8535 16.7895 1.7867 298.7899 59.3821 40.8080 20.5791 29.7203 2.8005 46.9316 23.9219 54.3929 60.3946 26.2930 20.9678 14.2266 0.3667 98.1897 34.3854
temp: 298.150 k
press: 1.00000 atm
elementType: 16 8 7 6 6 6 6 6 6 6 6 6 6 1 1 1 1 1 1 1 1 1 1 1 1 1 1 1
symmnumber: 1
zpe: 605299.8 jmol-1
zpe.correction: 0.230547 hartree
zpe.thermalcorrener: 0.244689 hartree
zpe.thermalcorrenthalpy: 0.245634 hartree
zpe.thermalcorrgfe: 0.188867 hartree
zpe.sumelectzpe: -917.089385 hartree
zpe.sumelectthermal: -917.075242 hartree
zpe.sumelectthermalent: -917.074297 hartree
zpe.sumelectthermalfe: -917.131064 hartree
dipole: -1.8385 0.9569 2.1080
dipole: 2.9563
quadrupole: -71.9235 -72.9035 -91.9734
quadrupole: 0.7737 0.2464 -2.8822
quadrupole: 7.0099 6.0300 -13.0399 0.7737 0.2464 -2.8822
hfenergy: -917.3199311 hartree
pointgroup: C01 [X(C10H15N1O1S1)]
dipole: -0.6653498 -0.6308289 -0.7156453 debye
polarizability: 201.3619911|7.3006223|132.9259941|12.7026155|-11.1897775|96.654401 unknown
InChI: InChI=1S/C10H15NOS/c1-3-6-13-8-4-5-9(11)10(7-8)12-2/h4-5,7H,3,6,11H2,1-2H3
charge 0 multiplicity 1
28 atoms
S  2.000293 0.498977 1.280007
O  -2.680079 -1.800129 0.163609
N  -3.673403 0.420574 -0.924186
C  2.998801 0.077459 -0.295407
C  4.5004 0.056016 0.035088
C  0.29333 0.4928 0.584802
C  -1.800884 -0.693104 0.149342
C  -0.488271 -0.69067 0.653019
C  -2.371701 0.48235 -0.44008
C  -0.257238 1.6617 0.017038
C  -1.575306 1.655107 -0.493736
C  5.353366 -0.292123 -1.206941
C  -2.190467 -3.034809 0.773967
H  2.760925 0.845845 -1.051381
H  2.649608 -0.904786 -0.658911
H  4.803093 1.044172 0.432741
H  4.690482 -0.682829 0.838011
H  -0.055048 -1.586468 1.107229
H  0.340183 2.578318 -0.018551
H  -1.995388 2.568143 -0.932412
H  5.201802 0.447924 -2.014827
H  6.429622 -0.304024 -0.955546
H  5.087043 -1.288523 -1.606495
H  -4.116769 1.232059 -1.341643
H  -4.18607 -0.453258 -0.843566
H  -3.021533 -3.751431 0.695635
H  -1.930046 -2.877524 1.838709
H  -1.307246 -3.426166 0.232284
