program: Gaussian 09
title: 000131575
version: EM64L-G09RevD.01
frameworkgroup: C1[X(C11H15NO)]
method: RPBEPBE
basis: SDD
operation: Freq
keyword: #p
keyword: freq=noraman
keyword: PBEPBE/SDD
title: #p freq=noraman PBEPBE/SDD
converged: YES YES NO NO
title: Mulliken charges:
elementType: O N C C C C C C C C C C C H H H H H H H H H H H H H H H
charge: -0.295830 -0.575085 -0.128748 -0.580232 -0.571355 0.321191 0.323439 -0.593841 -0.576748 0.344833 0.159667 -0.825166 -0.519172 0.236471 0.210645 0.239604 0.219414 0.215044 0.245313 0.258337 0.254830 0.270454 0.225091 0.254646 0.222264 0.216700 0.216849 0.231384
chargesum: 0.00000
title: Mulliken charges with hydrogens summed into heavy atoms:
elementType: O N C C C C C C C C C C C
charge: -0.295830 -0.049800 0.107723 -0.129983 -0.136897 0.321191 0.323439 -0.348528 -0.318411 0.344833 0.159667 -0.123165 0.145760
polarizability: 1.75811842e+02 -2.31440677e+00 1.28190912e+02 -2.19446986e+00 2.19777599e+00 7.88662152e+01
1716.lowfreq: -0.0007 -0.0003 0.0003 1.4949 9.3443 13.0786 50.5494 69.5445 102.7131
frequency: 50.4714 69.5414 102.6890 114.8675 157.1989 158.3170 205.8879 222.9279 258.4689 277.2689 289.7714 350.1645 367.2945 398.1630 435.2881 456.2906 466.5396 557.5620 594.7856 601.5439 630.3245 704.4343 732.6902 738.0876 811.4888 838.9857 874.4663 882.7859 905.5912 943.6948 970.4739 992.8514 1030.7770 1046.2257 1064.8689 1102.7576 1112.3007 1115.6228 1124.6740 1149.3048 1160.8948 1179.7948 1218.1761 1232.4637 1253.2521 1274.9418 1285.8792 1294.6993 1372.3468 1374.6201 1390.8789 1406.3475 1440.5894 1452.6194 1456.7764 1459.5046 1466.2446 1469.9621 1484.8698 1486.3201 1581.9460 1626.7284 1637.4762 2950.6779 2955.2543 2956.5022 2971.2261 2999.1057 3034.4764 3038.7045 3053.2016 3059.8852 3093.3101 3108.2140 3115.0017 3141.7764 3447.1585 3576.3976
redmass: 2.8280 3.6980 2.1602 1.1346 1.1654 2.4594 2.4175 2.9853 1.2969 2.8206 3.2473 3.9762 3.4074 2.8463 3.3270 2.1865 3.0866 3.7608 1.6010 4.1635 3.6506 5.2612 4.9871 3.3673 2.8867 3.4084 1.3370 1.4537 1.4923 5.7720 1.6125 1.5275 2.8165 1.5502 4.4722 1.3158 1.2457 1.2842 2.3480 1.4438 1.6317 3.9201 1.3390 1.4478 1.4060 1.5711 6.1119 1.2671 4.7133 1.4390 1.2670 3.6282 1.3297 1.0964 1.0612 1.1361 1.0626 1.0772 2.7165 1.1402 7.3287 7.6921 1.0970 1.0318 1.0682 1.0667 1.0406 1.0845 1.1036 1.0965 1.0922 1.0940 1.0998 1.1001 1.0916 1.0921 1.0448 1.0973
irintensity: 5.4038 1.5007 1.2968 0.2374 0.8200 3.4406 5.1128 5.3098 48.5597 9.1167 6.0793 5.3707 7.1542 4.0615 20.2693 7.3516 8.7697 2.3557 257.2815 2.2043 23.0089 2.1175 1.3332 0.8686 2.8287 2.5988 2.4925 17.3749 0.5618 36.1293 13.0071 6.7469 10.2060 7.3007 72.3506 0.2301 0.4960 4.7522 39.0600 2.2637 19.5412 35.7862 5.6224 24.1421 2.4096 10.3711 10.4024 2.1983 30.6498 10.3285 12.7037 2.3724 1.6376 11.1052 9.3404 6.3959 12.9933 8.3294 45.5450 41.5731 7.0141 3.0518 43.8066 76.5581 29.7911 47.5481 39.8447 27.6005 50.9784 40.5777 23.0709 30.0594 10.0974 36.2112 18.4109 6.2254 0.6189 0.3312
temp: 298.150 k
press: 1.00000 atm
elementType: 8 7 6 6 6 6 6 6 6 6 6 6 6 1 1 1 1 1 1 1 1 1 1 1 1 1 1 1
symmnumber: 1
zpe: 618563.1 jmol-1
zpe.correction: 0.235598 hartree
zpe.thermalcorrener: 0.248798 hartree
zpe.thermalcorrenthalpy: 0.249743 hartree
zpe.thermalcorrgfe: 0.196233 hartree
zpe.sumelectzpe: -557.149598 hartree
zpe.sumelectthermal: -557.136398 hartree
zpe.sumelectthermalent: -557.135454 hartree
zpe.sumelectthermalfe: -557.188963 hartree
dipole: 0.2992 -0.7714 1.0856
dipole: 1.3649
quadrupole: -72.9435 -72.7372 -79.2668
quadrupole: -6.5193 -9.6357 -2.6675
quadrupole: 2.0390 2.2453 -4.2843 -6.5193 -9.6357 -2.6675
hfenergy: -557.3851965 hartree
pointgroup: C01 [X(C11H15N1O1)]
dipole: 0.122614 0.3069404 -0.4232374 debye
polarizability: 175.6378023|2.7614258|128.2211531|4.0405374|2.5309595|79.0100132 unknown
InChI: InChI=1S/C11H15NO/c1-7-3-8-4-10(12)5-9(8)6-11(7)13-2/h3,6,10H,4-5,12H2,1-2H3
charge 0 multiplicity 1
28 atoms
O  -2.985233 0.986938 0.426297
N  4.447631 0.265601 -0.018964
C  3.031055 0.26399 -0.407367
C  2.332031 -1.095704 -0.089928
C  2.086007 1.334821 0.261361
C  0.859887 -0.724637 -0.005647
C  0.7172 0.676243 0.191934
C  -0.275389 -1.554128 -0.063331
C  -0.564316 1.242516 0.316595
C  -1.581759 -1.007462 0.055931
C  -1.69863 0.399019 0.241348
C  -2.813246 -1.893313 0.007675
C  -3.680357 1.319893 -0.827905
H  2.987941 0.419991 -1.503052
H  2.697948 -1.478611 0.887375
H  2.565049 -1.866831 -0.843987
H  2.134818 2.319505 -0.239252
H  2.396392 1.486129 1.317365
H  -0.16354 -2.637428 -0.198406
H  -0.714395 2.314876 0.483362
H  4.603423 0.089839 0.979707
H  4.983887 1.071216 -0.355038
H  -2.584013 -2.907897 0.377664
H  -3.624596 -1.466632 0.62161
H  -3.200205 -2.002094 -1.025027
H  -3.866639 0.415595 -1.440773
H  -3.093026 2.046398 -1.424109
H  -4.640229 1.770464 -0.530539
