program: Gaussian 09
title: 000131571
version: EM64L-G09RevD.01
frameworkgroup: C1[X(C18H12O4)]
method: RPBEPBE
basis: SDD
operation: Freq
keyword: #pfreq=noraman
keyword: PBEPBE/SDD
title: #p freq=noraman PBEPBE/SDD
converged: YES YES NO NO
title: Mulliken charges:
elementType: O O O O C C C C C C C C C C C C C C C C C C H H H H H H H H H H H H
charge: -0.265292 -0.168638 -0.427342 -0.251374 0.359330 -0.282730 -0.296438 -0.319783 0.117610 -0.192771 -0.194262 -0.223202 -0.198871 -0.192264 -0.310165 0.039305 -0.294917 -0.231417 -0.007134 0.163512 0.042950 0.009463 0.254157 0.258800 0.275448 0.225081 0.231289 0.230306 0.229062 0.250368 0.240484 0.275117 0.274386 0.379931
chargesum: 0.00000
title: Mulliken charges with hydrogens summed into heavy atoms:
elementType: O O O O C C C C C C C C C C C C C C C C C C
charge: -0.265292 -0.168638 -0.047411 -0.251374 0.359330 -0.028573 -0.037638 -0.044335 0.117610 0.032310 0.037027 0.007103 0.030191 0.058104 -0.069680 0.039305 -0.019800 0.042969 -0.007134 0.163512 0.042950 0.009463
polarizability: 1.66866879e+03 -6.01777747e+01 2.07376778e+02 -4.55003879e-02 -1.50131990e-01 7.91919840e+01
1716.lowfreq: -7.9846 -1.4519 -0.0009 0.0012 0.0013 1.3205 10.9601 15.9122 20.9797
frequency: 10.9465 15.6518 20.8361 34.5732 35.0531 65.0709 69.2359 91.2127 116.3118 125.4559 147.6878 148.6370 169.5403 182.4301 210.0087 235.0113 263.7999 263.9165 283.3330 315.1624 336.7213 356.4513 388.0222 393.6408 411.0094 459.6998 474.3609 482.6532 509.0319 517.2865 544.6334 551.5290 584.1179 593.1192 593.3812 669.8530 687.7241 691.1614 729.6151 732.2709 773.0139 799.2840 835.1155 875.8365 876.9227 884.0984 893.1634 911.8749 916.5970 921.9117 932.5476 961.7137 969.1358 1010.3979 1017.5649 1038.3920 1065.3442 1071.8220 1155.5259 1169.0404 1188.4389 1211.2591 1215.7102 1229.3401 1253.6599 1265.4372 1272.7394 1282.1866 1283.5627 1295.0167 1302.9044 1330.1845 1382.4106 1416.8786 1514.6440 1540.4972 1550.9505 1596.8847 1607.0992 1624.4049 1627.2625 1700.8968 2134.8589 2202.8993 3077.9013 3082.1801 3086.6770 3091.0225 3098.4777 3106.8435 3118.7552 3132.2052 3180.8471 3207.5176 3239.9625 3526.4849
redmass: 8.3341 6.8775 4.7025 8.6293 7.5156 6.8051 7.3168 3.5142 6.5164 2.8408 9.7198 3.4667 4.8314 7.5651 3.2256 7.1805 3.1285 6.1331 3.1577 3.6473 6.9427 3.1968 6.0290 2.9894 6.4393 5.6777 6.2208 5.9791 6.2950 8.3899 4.6467 4.1963 1.2747 3.5126 5.0288 7.8775 4.3136 5.0636 6.1532 6.0833 6.6785 1.5146 1.5198 1.5956 1.9531 1.4770 6.5075 1.7177 1.5001 1.3469 5.5847 1.1097 1.1237 1.0864 3.2159 2.1794 1.6224 2.3928 2.3812 1.7331 1.8217 1.6498 1.2883 2.0453 1.4839 1.3358 1.5993 1.8673 1.5000 1.5566 1.7709 1.8215 3.1315 3.2027 5.1386 4.3353 5.6118 6.7121 5.3449 7.3991 6.3584 12.2382 11.8835 11.9145 1.0880 1.0875 1.0928 1.0917 1.0904 1.0883 1.0895 1.0890 1.0933 1.0923 1.1052 1.0641
irintensity: 0.5047 3.8171 0.8661 0.2802 1.3402 0.0552 0.5710 2.2199 0.1096 1.5689 0.1917 1.5449 0.4604 1.8975 0.0058 4.2356 0.5270 9.8966 1.1697 0.7824 8.8998 0.9200 5.3307 1.5550 7.0651 0.1510 11.2647 0.8541 9.8328 0.7280 45.1235 31.5299 130.8519 2.8980 32.0406 6.2593 46.0929 0.7897 74.3732 88.0014 175.1670 71.9570 3.9095 3.3834 14.0109 0.1197 24.0350 4.6627 2.8515 0.0000 7.2953 1.5102 55.0258 176.2097 775.4051 40.4626 138.6306 503.6520 365.4681 17.1705 46.4957 47.4284 12.3689 42.1832 2.0494 39.2223 67.7224 3.4528 22.5631 21.0198 26.0648 290.9154 15.0361 109.8720 263.1646 254.1598 25.8386 1426.8659 307.8255 400.6017 14.2518 1724.5003 29.2842 497.9343 16.1657 0.0028 1.8747 0.8605 14.2295 29.7733 31.3897 20.7729 10.2103 3.1712 0.5963 130.0560
temp: 298.150 k
press: 1.00000 atm
elementType: 8 8 8 8 6 6 6 6 6 6 6 6 6 6 6 6 6 6 6 6 6 6 1 1 1 1 1 1 1 1 1 1 1 1
symmnumber: 1
zpe: 631439.6 jmol-1
zpe.correction: 0.240503 hartree
zpe.thermalcorrener: 0.262278 hartree
zpe.thermalcorrenthalpy: 0.263222 hartree
zpe.thermalcorrgfe: 0.184193 hartree
zpe.sumelectzpe: -992.340439 hartree
zpe.sumelectthermal: -992.318664 hartree
zpe.sumelectthermalent: -992.317720 hartree
zpe.sumelectthermalfe: -992.396749 hartree
dipole: 1.4848 2.1638 -0.0216
dipole: 2.6243
quadrupole: -231.0495 -109.7114 -132.0495
quadrupole: -2.0124 -0.0963 0.0088
quadrupole: -73.4460 47.8920 25.5540 -2.0124 -0.0963 0.0088
hfenergy: -992.5809419 hartree
pointgroup: C01 [X(C18H12O4)]
dipole: 0.5731853 0.8584417 -0.024142 debye
polarizability: 1669.9370921|-41.1769996|205.9962955|8.6953731|-3.0802288|79.3041622 unknown
InChI: InChI=1S/C18H12O4/c19-17(20)13-11-9-7-5-3-1-2-4-6-8-10-12-16-14-15-18(21)22-16/h1-2,4,6,8,10-15,19H
charge 0 multiplicity 1
34 atoms
O  -8.309415 -0.393508 -0.025324
O  -10.519462 0.459473 -0.053322
O  10.283595 2.622937 -0.012349
O  10.800337 0.349914 0.067633
C  -7.028721 0.19936 -0.033712
C  -7.176924 1.645817 -0.066893
C  -5.905194 -0.614055 -0.011364
C  -8.521009 1.951074 -0.079169
C  -9.30324 0.702303 -0.053606
C  -4.553794 -0.145428 -0.016531
C  -3.452134 -0.998157 0.006207
C  -2.091593 -0.550969 0.001969
C  -0.993165 -1.406764 0.024856
C  0.367483 -0.957198 0.021331
C  1.459212 -1.823123 0.045174
C  2.803702 -1.416749 0.043858
C  8.470386 1.095571 0.018409
C  7.923113 -0.169122 0.052938
C  4.020445 -1.112806 0.04483
C  9.933216 1.260926 0.028574
C  6.544041 -0.457548 0.048086
C  5.332904 -0.776834 0.046459
H  -6.346288 2.350964 -0.079754
H  -6.081257 -1.697218 0.011949
H  -8.991674 2.932174 -0.103407
H  -4.371062 0.938335 -0.039418
H  -3.631038 -2.083713 0.029008
H  -1.910671 0.534411 -0.020505
H  -1.171852 -2.492475 0.04733
H  0.556158 0.124892 -0.000896
H  1.265395 -2.906913 0.067065
H  7.854674 1.998153 -0.01671
H  8.624914 -1.017708 0.086946
H  11.275717 2.700184 -0.004363
