program: Gaussian 09
title: 000131570
version: EM64L-G09RevD.01
frameworkgroup: C1[X(C18H14O2)]
method: RPBEPBE
basis: SDD
operation: Freq
keyword: #pfreq=noraman
keyword: PBEPBE/SDD
title: #p freq=noraman PBEPBE/SDD
converged: YES YES NO NO
title: Mulliken charges:
elementType: O O C C C C C C C C C C C C C C C C C C H H H H H H H H H H H H H H
charge: -0.268555 -0.178331 0.356447 -0.286787 -0.298171 -0.326644 0.115069 -0.199273 -0.194677 -0.231896 -0.198319 -0.202778 -0.309924 -0.735008 -0.131836 -0.286478 0.028315 0.029258 -0.014490 -0.014869 0.252022 0.255891 0.272391 0.223488 0.228300 0.228442 0.225523 0.248079 0.235784 0.235428 0.235367 0.228225 0.240777 0.239231
chargesum: 0.00000
title: Mulliken charges with hydrogens summed into heavy atoms:
elementType: O O C C C C C C C C C C C C C C C C C C
charge: -0.268555 -0.178331 0.356447 -0.034765 -0.042280 -0.054253 0.115069 0.024216 0.033622 -0.003455 0.027204 0.045301 -0.074141 -0.035988 0.108941 -0.047247 0.028315 0.029258 -0.014490 -0.014869
polarizability: 1.50896705e+03 3.34339660e+01 1.91065124e+02 -2.19047694e-01 -3.13432887e-01 8.25765278e+01
1716.lowfreq: -0.0011 -0.0005 0.0013 1.7910 2.1281 6.4409 13.7945 22.6089 28.9804
frequency: 13.7167 22.4467 28.9352 40.1065 47.3808 79.0160 79.2313 94.3318 125.3910 136.4730 159.4617 167.0946 174.5719 213.9381 215.8465 263.0187 268.0404 285.6064 316.6435 317.6906 365.2915 367.4326 398.1320 412.6973 440.8672 460.5521 486.8499 502.0861 509.2004 549.4552 571.1208 592.7899 669.9120 690.0842 728.7966 733.3721 774.4189 795.9198 801.3752 833.2929 874.4498 881.9022 894.1767 909.0052 913.8437 913.9424 917.8025 953.0125 960.6152 1009.3508 1037.7380 1039.9755 1048.9915 1065.3797 1115.4288 1154.4434 1169.2263 1188.4453 1211.3233 1227.8098 1253.2986 1267.2576 1273.3326 1283.1553 1283.3641 1287.2267 1296.1870 1318.6260 1372.0820 1393.4692 1415.2201 1455.1078 1463.7037 1511.0328 1544.8633 1552.7143 1608.4484 1622.9171 1629.1710 1696.9647 2135.5824 2211.4878 2965.9146 3036.8817 3072.3076 3078.6690 3083.2996 3083.9175 3086.8033 3095.7893 3104.5698 3117.9117 3118.6909 3129.9639 3206.6500 3239.1402
redmass: 5.5120 4.9083 3.3113 6.0809 2.6949 5.1517 3.7494 2.9244 5.7805 2.6339 8.0870 3.2759 1.4826 6.1408 3.2122 2.9932 5.5685 3.3467 3.6010 4.1868 4.5296 2.9169 3.4786 5.1235 6.5109 5.6739 6.4438 6.8903 8.9916 3.8763 4.8180 3.5312 7.8894 5.0051 4.5803 6.4646 6.7345 1.5144 1.6084 1.5328 1.6073 1.4431 6.4925 1.7493 1.4744 1.7094 1.3524 1.0769 1.1046 1.0861 1.5674 2.0739 3.6877 1.6571 2.3638 2.4504 1.7583 1.7920 1.6443 1.9893 1.4653 1.3734 1.5887 1.4767 1.7092 1.3609 1.4017 1.6135 3.0982 1.2370 2.8832 1.0476 1.0932 5.2610 4.4445 5.3712 5.2763 5.5323 6.1544 12.1767 11.8887 11.9179 1.0372 1.0960 1.0877 1.0888 1.0977 1.0928 1.0914 1.0901 1.0885 1.0897 1.0911 1.0889 1.0921 1.1050
irintensity: 0.0571 3.0902 0.0131 2.9369 0.6081 0.2215 0.8688 3.5021 0.2512 0.4341 0.1789 0.6947 0.9678 1.0251 0.1551 0.4155 8.3371 0.7357 0.7589 5.4006 12.2251 1.7833 1.1007 10.7121 4.5943 0.0027 2.4566 0.6790 0.2939 0.2411 12.7601 2.9945 13.6402 0.7063 4.6508 74.9286 149.3484 72.2575 0.5389 3.2770 6.9378 0.0178 28.0684 3.2428 7.6554 43.7809 0.0334 63.4752 0.7071 179.3538 0.4301 38.3744 22.9005 23.0184 2.8728 516.4750 10.0026 2.7078 167.3798 22.7214 16.5796 62.6568 12.0719 19.7135 8.9761 48.8936 11.0742 13.6917 109.3026 5.5617 39.4749 16.8696 43.1867 623.7789 42.3730 156.4284 27.9377 60.9255 27.9327 1774.6630 4.4467 228.3118 67.3881 18.0525 14.4624 58.3161 13.2157 3.0714 0.7413 16.4718 29.8506 34.3516 39.9624 20.7397 2.7189 0.4724
temp: 298.150 k
press: 1.00000 atm
elementType: 8 8 6 6 6 6 6 6 6 6 6 6 6 6 6 6 6 6 6 6 1 1 1 1 1 1 1 1 1 1 1 1 1 1
symmnumber: 1
zpe: 667008.8 jmol-1
zpe.correction: 0.254050 hartree
zpe.thermalcorrener: 0.274674 hartree
zpe.thermalcorrenthalpy: 0.275618 hartree
zpe.thermalcorrgfe: 0.200646 hartree
zpe.sumelectzpe: -843.215265 hartree
zpe.sumelectthermal: -843.194641 hartree
zpe.sumelectthermalent: -843.193697 hartree
zpe.sumelectthermalfe: -843.268669 hartree
dipole: -9.0739 2.6980 -0.0270
dipole: 9.4665
quadrupole: -149.2650 -99.6482 -123.3002
quadrupole: 3.6478 -0.4265 -0.1431
quadrupole: -25.1939 24.4229 0.7710 3.6478 -0.4265 -0.1431
hfenergy: -843.469315 hartree
pointgroup: C01 [X(C18H14O2)]
dipole: 3.5488527 -1.1284908 0.0581367 debye
polarizability: 1509.7263371|8.3769627|190.0811209|7.1174116|-4.4782786|82.8012394 unknown
InChI: InChI=1S/C18H14O2/c1-2-3-4-5-6-7-8-9-10-11-12-13-14-17-15-16-18(19)20-17/h2-3,8-16H,1H3
charge 0 multiplicity 1
34 atoms
O  -7.279264 0.571028 -0.037598
O  -9.531414 -0.16427 -0.013866
C  -6.029168 -0.087473 -0.013429
C  -6.253012 -1.521555 0.036667
C  -4.864419 0.666684 -0.03832
C  -7.612708 -1.756599 0.043678
C  -8.32805 -0.470769 -0.002073
C  -3.538366 0.131923 -0.018276
C  -2.394392 0.927569 -0.042924
C  -1.056814 0.416551 -0.022233
C  0.081674 1.218307 -0.04544
C  1.421695 0.709787 -0.022231
C  2.549586 1.527175 -0.044727
C  10.905666 -2.009579 0.168898
C  9.443824 -1.652184 0.141472
C  8.959402 -0.367836 0.075735
C  3.879228 1.072054 -0.020336
C  7.582845 -0.023124 0.050446
C  5.083393 0.723476 0.001303
C  6.385296 0.339403 0.026108
H  -5.459858 -2.268358 0.063823
H  -4.985291 1.757185 -0.075844
H  -8.133694 -2.711654 0.076912
H  -3.410388 -0.959321 0.01876
H  -2.519923 2.02052 -0.079893
H  -0.92804 -0.675851 0.014969
H  -0.046902 2.311045 -0.082845
H  1.562633 -0.379014 0.016121
H  2.399247 2.617789 -0.083906
H  11.156651 -2.575659 1.087671
H  11.167665 -2.666798 -0.683697
H  11.550221 -1.114715 0.127012
H  8.72321 -2.48147 0.177269
H  9.676566 0.466532 0.039796
