program: Gaussian 09
title: 000131569
version: EM64L-G09RevD.01
frameworkgroup: C1[X(C18H16O2)]
method: RPBEPBE
basis: SDD
operation: Freq
keyword: #pfreq=noraman
keyword: PBEPBE/SDD
title: #p freq=noraman PBEPBE/SDD
converged: YES YES NO NO
title: Mulliken charges:
elementType: O O C C C C C C C C C C C C C C C C C C H H H H H H H H H H H H H H H H
charge: -0.268658 -0.178057 -0.353237 -0.489514 -0.677866 0.356300 -0.286391 -0.298297 -0.326609 0.115104 -0.199396 0.091894 -0.194788 -0.232350 -0.199889 -0.200556 -0.083722 -0.315492 -0.022982 0.031437 0.215262 0.208386 0.235137 0.241778 0.235523 0.219652 0.208099 0.252061 0.255891 0.272434 0.223425 0.228302 0.228420 0.225568 0.248077 0.235055
chargesum: 0.00000
title: Mulliken charges with hydrogens summed into heavy atoms:
elementType: O O C C C C C C C C C C C C C C C C C C
charge: -0.268658 -0.178057 0.070411 -0.012599 -0.014592 0.356300 -0.034330 -0.042406 -0.054174 0.115104 0.024029 0.091894 0.033514 -0.003931 0.025679 0.047521 -0.083722 -0.080437 -0.022982 0.031437
polarizability: 1.23798353e+03 -8.65332640e+01 1.72115967e+02 -1.07246064e+01 -1.65661036e+01 1.00348107e+02
1716.lowfreq: -10.2718 -4.1035 -0.0013 0.0007 0.0009 1.4388 4.1704 15.1383 19.7048
frequency: -7.6000 14.8562 19.6256 37.6485 43.1241 67.7450 82.2255 87.7012 117.3281 125.6623 148.2884 166.0474 195.7747 208.4678 238.7955 253.3311 260.1796 285.0314 313.1600 316.7752 334.5940 353.4768 382.9800 403.1392 421.8050 470.1876 487.2953 493.6620 513.4338 548.0002 556.6541 592.5623 660.2539 671.3641 690.3414 732.8662 773.5261 784.0510 796.2979 832.3129 841.8163 872.4669 873.8838 882.1782 893.6480 909.3701 914.8966 918.5384 960.8050 974.6914 1009.2383 1039.4157 1064.6697 1066.0222 1074.1433 1092.7643 1153.4606 1165.2248 1187.0792 1210.1534 1216.5002 1224.7008 1250.7307 1253.0629 1272.9598 1278.1182 1283.1726 1291.1081 1298.0905 1314.2721 1336.9504 1361.0890 1392.7658 1410.6821 1448.6999 1468.4677 1477.6139 1485.0957 1511.9340 1549.2761 1555.5889 1609.9809 1628.4895 1697.9898 2145.2456 2251.1308 2962.1923 2979.5097 2990.1231 3014.2378 3045.7617 3072.3004 3077.7186 3083.9196 3084.0453 3087.2517 3096.0659 3104.4853 3117.1268 3129.6961 3206.1767 3238.9360
redmass: 2.9116 5.1361 5.2552 5.3492 5.1062 4.7865 3.8339 2.5131 4.4715 3.0535 4.5272 4.2283 5.1399 2.6717 1.7320 3.0159 3.1679 2.9843 3.3936 5.2312 2.5410 5.0357 2.6898 4.8740 4.7357 5.4873 8.9768 5.4639 6.4414 3.8231 4.0680 3.5307 3.8659 6.1601 5.0109 6.4508 5.9717 1.3755 1.5137 1.5401 2.4718 1.4637 1.6024 1.4571 6.5187 1.8504 1.3916 1.3490 1.1063 2.7338 1.0861 2.0684 1.8251 1.7809 1.9452 1.7029 2.4477 1.7702 1.7584 1.7026 1.2514 1.9975 1.2835 1.4337 1.6248 1.9360 1.4480 1.5849 1.3202 1.4727 1.4515 2.6648 1.2206 2.6881 1.0934 1.0703 1.0439 1.0574 5.4551 4.9526 4.9922 5.4093 6.3119 12.1851 11.8408 11.8749 1.0584 1.0358 1.0636 1.0969 1.1014 1.0878 1.1001 1.0940 1.0991 1.0912 1.0899 1.0883 1.0897 1.0888 1.0923 1.1049
irintensity: 0.6954 0.1941 2.2493 0.8488 2.2424 0.7555 0.0040 3.9356 0.3291 1.2428 0.9076 0.1858 0.8983 0.1281 2.6506 0.4369 0.3793 1.5252 0.2728 3.4068 0.6232 17.1810 2.9815 5.1773 0.1122 4.2027 0.2646 2.4413 1.2551 0.2816 2.2124 2.9867 18.0113 5.8472 0.7188 67.4973 150.5544 11.4811 72.2571 2.6253 4.6157 2.3661 7.9588 0.0084 24.2729 2.0916 4.6940 0.0345 0.0068 2.0602 180.7085 38.2091 30.1503 2.2920 2.7866 11.8329 386.3785 4.5142 1.3163 155.0708 11.1660 29.6077 8.5116 11.1399 45.7424 45.9242 20.2741 0.8577 20.9155 7.4304 18.3021 89.1666 19.0396 61.0413 25.1074 5.9392 5.4566 13.1695 512.1631 23.7802 157.8864 9.0323 8.1567 1569.8053 9.4978 251.1166 42.7282 25.3462 96.3596 35.9852 16.2452 16.9528 53.8747 25.4318 71.1223 0.7206 13.1645 30.4743 35.8004 18.2378 2.4845 0.4537
temp: 298.150 k
press: 1.00000 atm
elementType: 8 8 6 6 6 6 6 6 6 6 6 6 6 6 6 6 6 6 6 6 1 1 1 1 1 1 1 1 1 1 1 1 1 1 1 1
symmnumber: 1
zpe: 729053.9 jmol-1
zpe.correction: 0.277682 hartree
zpe.thermalcorrener: 0.297731 hartree
zpe.thermalcorrenthalpy: 0.298675 hartree
zpe.thermalcorrgfe: 0.225633 hartree
zpe.sumelectzpe: -844.402402 hartree
zpe.sumelectthermal: -844.382353 hartree
zpe.sumelectthermalent: -844.381409 hartree
zpe.sumelectthermalfe: -844.454451 hartree
dipole: 8.7230 2.1375 -0.8445
dipole: 9.0207
quadrupole: -158.4595 -106.0856 -120.7731
quadrupole: -8.8481 5.4713 -5.2951
quadrupole: -30.0201 22.3538 7.6663 -8.8481 5.4713 -5.2951
hfenergy: -844.6800838 hartree
pointgroup: C01 [X(C18H16O2)]
dipole: -3.4141981 0.9221359 0.2972244 debye
polarizability: 1241.1706709|63.8707738|169.9437098|-10.1101579|14.7617017|99.333223 unknown
InChI: InChI=1S/C18H16O2/c1-2-3-4-5-6-7-8-9-10-11-12-13-14-17-15-16-18(19)20-17/h8-16H,2-3H2,1H3
charge 0 multiplicity 1
36 atoms
O  7.179931 -0.57071 -0.283385
O  9.438342 0.136711 -0.170192
C  -9.630795 1.196098 -0.576384
C  -9.071952 0.415601 0.65469
C  -8.899747 2.529678 -0.829993
C  5.938291 0.060271 -0.043843
C  6.178279 1.436886 0.352995
C  4.765696 -0.66272 -0.208339
C  7.539247 1.663446 0.361873
C  8.239642 0.429697 -0.032044
C  3.44701 -0.148979 0.001532
C  -7.667941 0.011733 0.502158
C  2.294464 -0.910339 -0.177431
C  0.963674 -0.418858 0.026874
C  -0.183339 -1.184723 -0.156321
C  -1.517317 -0.694872 0.047131
C  -6.478665 -0.326181 0.352751
C  -2.653507 -1.473912 -0.142865
C  -5.176369 -0.700809 0.190319
C  -3.979103 -1.032957 0.043322
H  -9.560545 0.549806 -1.471449
H  -10.707113 1.382292 -0.394493
H  -9.172235 1.050638 1.559001
H  -9.692776 -0.485964 0.831252
H  -7.825617 2.360257 -1.025375
H  -9.327238 3.053472 -1.703883
H  -8.983546 3.203095 0.043728
H  5.3946 2.153589 0.59736
H  4.87198 -1.708783 -0.52401
H  8.070406 2.580605 0.609707
H  3.333493 0.897223 0.319582
H  2.404802 -1.957997 -0.49666
H  0.850267 0.627881 0.347482
H  -0.070384 -2.231682 -0.477485
H  -1.64221 0.348367 0.368064
H  -2.519327 -2.51886 -0.464767
