program: Gaussian 09
title: 000131567
version: EM64L-G09RevD.01
frameworkgroup: C1[X(C15H13FN2O)]
method: RPBEPBE
basis: SDD
operation: Freq
keyword: #p
keyword: freq=noraman
keyword: PBEPBE/SDD
title: #p freq=noraman PBEPBE/SDD
converged: NO NO NO NO
title: Mulliken charges:
elementType: F O N N C C C C C C C C C C C C C C C H H H H H H H H H H H H H
charge: -0.200549 -0.266900 -0.436039 -0.081012 0.089258 0.213859 0.513837 -0.539270 0.075222 -0.343879 -0.427590 0.330997 -0.311812 -0.327680 -0.345458 -0.726416 -0.367222 -0.365432 0.319452 0.264772 0.248439 0.218660 0.297026 0.216282 0.216433 0.267144 0.277433 0.222419 0.221596 0.231307 0.257024 0.258098
chargesum: 0.00000
title: Mulliken charges with hydrogens summed into heavy atoms:
elementType: F O N N C C C C C C C C C C C C C C C
charge: -0.200549 -0.266900 -0.139013 -0.081012 0.089258 0.213859 0.513837 -0.274498 0.075222 -0.095441 -0.208930 0.330997 0.120903 -0.060536 -0.068025 -0.051094 -0.110198 -0.107334 0.319452
polarizability: 3.75405082e+02 -1.07844990e+01 1.75826834e+02 2.51601768e-02 7.93688958e-02 7.95382153e+01
1716.lowfreq: -0.2656 -0.0010 -0.0007 -0.0005 2.9128 15.6257 35.3966 52.1409 60.5355
frequency: 35.0499 52.1168 60.5318 64.9219 98.6628 124.1863 124.6348 193.0190 227.5434 251.1387 254.7302 277.6380 297.3970 328.1493 337.9653 375.8044 386.9371 412.9165 431.8418 435.1405 509.3260 514.7755 548.6467 595.6002 621.9583 623.8413 627.9708 673.4961 730.5524 735.3852 762.3068 795.6920 797.5214 812.9838 815.1552 824.0508 846.1419 851.7137 862.1831 916.6026 927.1048 954.5940 964.7488 977.5090 989.5670 1011.2433 1066.1113 1102.1246 1109.8283 1143.6485 1147.9855 1157.0910 1170.0451 1180.7322 1200.7468 1257.8904 1265.6735 1266.8252 1288.0121 1293.9802 1355.2815 1374.0417 1379.5153 1395.5136 1413.4993 1440.9970 1469.3432 1476.4817 1478.8678 1491.2145 1492.4461 1506.5497 1546.6917 1591.3061 1601.8563 1616.5430 1636.5503 2926.2921 2961.1863 2980.8704 3073.3334 3093.0104 3124.0267 3159.9452 3160.1521 3172.1390 3177.5096 3181.1674 3183.2422 3574.9516
redmass: 4.9319 4.7903 5.5538 3.2013 2.0750 5.0253 5.5312 5.5832 6.1043 4.9260 1.2665 5.8119 1.0949 4.3736 7.0609 6.1571 7.6131 2.9897 2.9984 4.1999 2.9050 7.6419 5.9309 6.2870 3.1371 7.3429 7.0238 5.9585 3.9778 4.1398 6.1387 6.4241 1.5029 6.2638 1.1553 1.2483 1.5885 1.5829 12.9010 2.0551 1.3249 2.5818 1.3520 1.3478 7.9324 2.6029 2.5756 1.5627 1.6919 2.9948 1.4967 1.4266 2.7884 2.0906 2.2705 4.5631 1.1088 1.3912 2.1434 1.2783 1.7711 4.6476 2.9778 1.2430 3.9327 3.9869 3.0094 1.0408 1.1885 2.4238 1.9598 1.1501 6.3468 7.9240 7.1786 6.5873 7.5260 1.0576 1.1042 1.0364 1.1007 1.0985 1.0893 1.0889 1.0887 1.0956 1.0972 1.0981 1.0920 1.0772
irintensity: 0.8204 0.0758 0.2156 0.0419 12.3848 1.0256 1.4687 1.7083 0.4692 4.1601 9.5908 6.7789 76.1441 1.0053 1.0111 0.5707 0.0216 0.0048 1.7212 0.8090 20.3576 11.2092 2.4422 9.7967 4.1655 4.8038 3.0942 14.8728 4.9302 0.2211 21.7898 20.2802 53.3789 20.4108 20.2680 1.4865 82.3529 23.8591 12.8297 1.3392 0.7846 14.5187 0.3854 0.1782 43.8105 4.5275 2.7584 11.4068 7.5157 13.5760 1.9071 94.6785 17.8662 19.2791 63.2310 26.6206 0.0929 3.5323 49.8348 4.0784 4.5159 13.0614 17.2729 36.0923 8.9059 32.5685 85.2079 13.5621 147.3054 298.5720 9.5698 2.4059 29.9113 20.4122 37.6393 80.4786 195.3622 51.2225 40.6826 37.5885 44.4332 29.6098 14.7346 1.8338 3.6648 8.7443 2.6710 5.1299 10.1777 51.6223
temp: 298.150 k
press: 1.00000 atm
elementType: 9 8 7 7 6 6 6 6 6 6 6 6 6 6 6 6 6 6 6 1 1 1 1 1 1 1 1 1 1 1 1 1
symmnumber: 1
zpe: 644465.5 jmol-1
zpe.correction: 0.245464 hartree
zpe.thermalcorrener: 0.261782 hartree
zpe.thermalcorrenthalpy: 0.262726 hartree
zpe.thermalcorrgfe: 0.200730 hartree
zpe.sumelectzpe: -862.634046 hartree
zpe.sumelectthermal: -862.617728 hartree
zpe.sumelectthermalent: -862.616783 hartree
zpe.sumelectthermalfe: -862.678780 hartree
dipole: -5.1992 0.7570 -0.0089
dipole: 5.2540
quadrupole: -92.7363 -98.6820 -115.3813
quadrupole: 2.9969 0.0632 -0.0043
quadrupole: 9.5302 3.5845 -13.1148 2.9969 0.0632 -0.0043
hfenergy: -862.8795096 hartree
pointgroup: C01 [X(C15H13F1N2O1)]
dipole: 2.0484091 0.2771898 0.0035097 debye
polarizability: 375.602207|8.7706719|175.6297094|0.0243589|-0.0796185|79.5382153 unknown
InChI: InChI=1S/C15H13FN2O/c1-2-17-12-7-8-14-13(9-12)18-15(19-14)10-3-5-11(16)6-4-10/h3-9,17H,2H2,1H3
charge 0 multiplicity 1
32 atoms
F  -6.585542 -0.633651 -0.000136
O  -0.46221 1.446867 -0.000848
N  4.921041 -0.065502 0.000978
N  -0.029523 -0.835293 0.001989
C  1.2046 -0.134804 0.00127
C  0.94471 1.265631 -0.000435
C  3.584229 0.332295 0.001184
C  2.526067 -0.623056 0.002477
C  -0.97311 0.109533 0.00064
C  1.960174 2.228874 -0.001071
C  3.282414 1.742044 -0.00041
C  -2.421466 -0.061911 0.000414
C  5.356315 -1.46425 0.002855
C  -3.296739 1.059385 -0.000525
C  -2.963209 -1.378281 0.001181
C  6.891888 -1.555989 -0.009753
C  -4.6931 0.873288 -0.000729
C  -4.356394 -1.575813 0.000998
C  -5.191721 -0.442271 0.000047
H  2.716128 -1.698316 0.004893
H  1.7485 3.30148 -0.002233
H  4.113926 2.457788 -0.001385
H  5.640812 0.655913 0.007531
H  4.958115 -1.988517 0.899467
H  4.943392 -1.99329 -0.88393
H  -2.876543 2.069394 -0.001121
H  -2.275294 -2.229065 0.001904
H  7.311607 -1.074897 -0.912969
H  7.327124 -1.068681 0.882864
H  7.21148 -2.612318 -0.008447
H  -5.3845 1.721008 -0.001454
H  -4.793172 -2.578696 0.001554
