program: Gaussian 09
title: 000131552
version: EM64L-G09RevD.01
frameworkgroup: C1[X(C14H8F5NO2)]
method: RPBEPBE
basis: SDD
operation: Freq
keyword: #p
keyword: freq=noraman
keyword: PBEPBE/SDD
title: #p freq=noraman PBEPBE/SDD
converged: YES YES NO NO
title: Mulliken charges:
elementType: F F F F F O O N C C C C C C C C C C C C C C H H H H H H H H
charge: -0.143625 -0.138910 -0.123053 -0.156867 -0.156897 -0.412095 -0.175899 0.099572 0.381127 -0.684571 0.149736 0.494597 0.018863 -0.065715 0.052242 0.191026 -0.371361 -0.447358 0.068618 -0.216552 -0.219647 -0.240759 0.261512 0.273747 0.233740 0.238358 0.231157 0.229811 0.233404 0.395796
chargesum: 0.00000
title: Mulliken charges with hydrogens summed into heavy atoms:
elementType: F F F F F O O N C C C C C C C C C C C C C C
charge: -0.143625 -0.138910 -0.123053 -0.156867 -0.156897 -0.016298 -0.175899 0.099572 0.381127 -0.149312 0.149736 0.494597 0.018863 -0.065715 0.052242 0.191026 -0.137621 -0.209000 0.068618 0.014606 0.010164 -0.007354
polarizability: 2.36108253e+02 1.47633789e+01 1.36786189e+02 -7.00213267e+00 1.16196068e+00 1.36208595e+02
1716.lowfreq: -8.8424 -4.8474 -2.5902 -0.0010 0.0009 0.0012 17.3669 31.6449 37.6817
frequency: 16.8158 31.6324 37.6763 53.1180 61.9149 75.0436 100.9541 114.4262 143.0922 161.2918 176.1483 195.4241 223.9466 230.9804 245.5034 282.2459 291.1571 327.3761 351.1343 375.0042 395.4668 402.7005 432.4742 452.4016 462.0917 468.3010 522.1706 536.9494 571.1255 604.4364 610.8553 619.4423 638.7919 671.7772 688.4263 703.0424 722.2207 754.4839 760.0083 795.0277 820.3539 832.2303 841.6976 853.2979 909.2579 922.7077 973.1290 977.3012 986.0683 991.5392 999.1875 1027.1795 1060.6944 1082.8999 1085.7800 1174.2791 1189.7883 1197.7936 1211.6278 1224.7960 1288.4831 1303.5240 1330.3884 1342.1845 1369.2630 1383.7816 1418.2888 1435.6167 1442.7951 1461.6247 1484.6976 1569.4483 1593.7748 1612.0920 1614.8600 1657.0931 3015.4856 3066.8306 3117.3230 3119.8070 3136.6010 3147.6638 3166.6258 3510.7292
redmass: 5.3772 4.8042 9.3237 12.2617 10.7933 9.1658 9.4087 15.7403 10.7359 6.6663 10.9171 7.7754 6.7035 9.1909 12.1045 15.0399 10.3151 2.4927 10.8192 8.9490 13.7651 2.7970 9.8506 3.7586 11.0934 6.5387 5.0965 4.0928 2.4679 7.7757 4.9782 6.6543 3.1419 6.4909 9.3580 2.1100 3.2767 3.3657 3.9252 7.5040 6.5456 9.5333 8.0611 1.2499 1.5381 4.5220 2.7272 1.4465 5.4220 5.9121 1.3691 2.2508 6.7581 2.6216 1.7950 1.0561 1.1124 2.2496 2.4601 1.7601 3.2738 1.6081 5.7986 1.4157 4.9886 6.7459 8.3607 10.7149 2.1684 1.1236 2.1803 11.0663 6.1652 8.1652 7.4695 9.9190 1.0596 1.1009 1.0879 1.0875 1.0905 1.0956 1.1014 1.0640
irintensity: 0.1989 0.1449 0.0600 0.2462 0.3134 1.3352 0.1337 1.0673 0.4004 1.4275 0.5896 0.7871 1.0343 1.9034 0.0234 0.8967 0.4591 3.1460 1.9049 2.7929 15.2294 0.0643 1.1040 12.3414 2.9335 4.9779 13.7413 22.9950 58.5054 11.8443 52.0468 3.0032 152.3017 12.9901 16.2529 44.1532 10.3488 23.2029 71.4715 39.2539 81.3974 5.4049 59.9652 1.1138 2.3258 28.5891 59.3530 8.4077 143.5118 13.0891 3.7086 7.0493 48.1924 57.8234 23.9262 0.0420 1.7001 28.6453 37.0618 42.2338 52.6173 6.1782 27.7197 3.1822 22.8748 0.3330 75.6114 181.1443 16.5523 23.1416 15.4099 24.0866 1.1588 2.4531 17.2276 184.0361 4.9564 2.4860 6.1893 9.2970 6.5949 33.1868 21.2702 46.3292
temp: 298.150 k
press: 1.00000 atm
elementType: 9 9 9 9 9 8 8 7 6 6 6 6 6 6 6 6 6 6 6 6 6 6 1 1 1 1 1 1 1 1
symmnumber: 1
zpe: 503972.8 jmol-1
zpe.correction: 0.191953 hartree
zpe.thermalcorrener: 0.211665 hartree
zpe.thermalcorrenthalpy: 0.212609 hartree
zpe.thermalcorrgfe: 0.141358 hartree
zpe.sumelectzpe: -1241.002096 hartree
zpe.sumelectthermal: -1240.982384 hartree
zpe.sumelectthermalent: -1240.981440 hartree
zpe.sumelectthermalfe: -1241.052691 hartree
dipole: 5.6351 0.0671 -2.2235
dipole: 6.0582
quadrupole: -125.8829 -132.5975 -118.1059
quadrupole: -1.1297 -2.2447 -8.8349
quadrupole: -0.3542 -7.0687 7.4229 -1.1297 -2.2447 -8.8349
hfenergy: -1241.194049 hartree
pointgroup: C01 [X(C14H8F5N1O2)]
dipole: -2.2046335 0.3936412 0.8158955 debye
polarizability: 233.6804852|-22.3475081|138.6470099|-2.034429|-1.1860244|136.775542 unknown
InChI: InChI=1S/C14H8F5NO2/c15-10-8(6-7-4-2-1-3-5-7)9(14(21)22)11(16)12(17)13(10)20(18)19/h1-5,21H,6H2
charge 0 multiplicity 1
30 atoms
F  1.139626 -2.147116 1.581777
F  1.700406 2.573816 -1.298727
F  3.824514 0.863277 -1.095377
F  4.032232 -1.97662 -0.964497
F  4.723156 -0.886793 0.968109
O  -1.408462 2.469231 1.01213
O  -1.218981 2.478614 -1.305784
N  3.562095 -1.681853 0.434919
C  0.137285 -0.101282 0.779519
C  -1.162565 -0.485854 1.474962
C  0.296941 1.097818 0.02677
C  -2.373521 -0.61013 0.546576
C  1.258018 -0.955516 0.860745
C  2.503488 -0.679652 0.247416
C  1.531656 1.387438 -0.592897
C  2.632872 0.521422 -0.48638
C  -2.284817 -1.300196 -0.689173
C  -3.626114 -0.079919 0.943989
C  -0.838511 2.062186 -0.195779
C  -3.423188 -1.453156 -1.510778
C  -4.768189 -0.236797 0.126888
C  -4.669513 -0.92237 -1.105655
H  -1.379782 0.26856 2.251851
H  -1.004159 -1.447705 1.994219
H  -1.324362 -1.720314 -1.012332
H  -3.708085 0.450863 1.900601
H  -3.338344 -1.985761 -2.464388
H  -5.730628 0.17642 0.448968
H  -5.552249 -1.04019 -1.743483
H  -2.17352 3.079079 0.823413
