program: Gaussian 09
title: 000131551
version: EM64L-G09RevD.01
frameworkgroup: C1[X(C14H7F5NO2)]
method: RPBEPBE
basis: SDD
operation: Freq
keyword: #p
keyword: freq=noraman
keyword: PBEPBE/SDD
title: #p freq=noraman PBEPBE/SDD
converged: YES YES NO NO
title: Mulliken charges:
elementType: F F F F F O O N C C C C C C C C C C C C C C H H H H H H H
charge: -0.173196 -0.171984 -0.156932 -0.207181 -0.204618 -0.351370 -0.334199 0.062379 0.312895 -0.710965 0.075903 0.491498 0.031073 -0.030186 0.077208 0.140928 -0.400101 -0.422598 0.028986 -0.243728 -0.235313 -0.252195 0.218159 0.273398 0.325069 0.224043 0.215802 0.208028 0.209196
chargesum: -1.00000
title: Mulliken charges with hydrogens summed into heavy atoms:
elementType: F F F F F O O N C C C C C C C C C C C C C C
charge: -0.173196 -0.171984 -0.156932 -0.207181 -0.204618 -0.351370 -0.334199 0.062379 0.312895 -0.219408 0.075903 0.491498 0.031073 -0.030186 0.077208 0.140928 -0.075032 -0.198555 0.028986 -0.027926 -0.027284 -0.042999
polarizability: 2.22740641e+02 -2.44576739e+01 2.22728134e+02 -5.81056518e+00 1.58603337e+00 1.33017346e+02
1716.lowfreq: -4.0767 0.0006 0.0009 0.0010 5.5883 8.6771 25.8029 35.6637 39.2605
frequency: 25.7803 35.6502 39.2539 47.9542 56.6898 81.3834 104.1883 112.6578 136.4477 152.4720 158.3605 191.9036 206.6063 226.1614 238.0471 276.0724 282.5675 314.5685 346.1651 366.5595 388.9992 406.1950 420.2382 446.2085 458.9495 462.1606 516.8515 556.6484 571.6323 590.2871 616.3360 627.6781 652.0210 656.9106 682.0030 706.3670 714.6867 737.6403 758.9955 774.6168 816.3073 841.5092 858.8755 902.2697 926.5387 957.9698 974.6913 987.5004 1019.3854 1020.4850 1027.6561 1045.4096 1083.8617 1164.8650 1179.3316 1194.6735 1200.7545 1210.4728 1250.3290 1289.0811 1307.3695 1342.4993 1367.7313 1379.5117 1385.6289 1438.6283 1442.2713 1473.0719 1487.0763 1518.7144 1532.5640 1590.7687 1600.8986 1612.2640 3006.5200 3064.1728 3084.2915 3105.7274 3118.4767 3132.4137 3148.8048
redmass: 9.6342 5.4538 10.1438 6.5021 13.0247 12.0666 13.9113 10.1712 13.6763 9.1973 11.1551 7.0575 13.3895 6.3431 15.6255 14.6496 17.3541 12.9391 2.6717 6.9000 8.8550 2.8803 9.5630 8.0624 7.3231 11.2100 6.4941 6.1254 7.1469 12.0277 6.1702 9.8334 10.7623 12.5247 9.6714 2.2796 3.7510 5.6834 2.8703 6.6241 3.7468 10.1603 1.2786 4.7076 1.6909 2.0325 1.3382 6.0159 2.0279 2.9976 2.3364 7.1046 1.6201 1.0639 1.2893 1.6956 5.5928 1.6381 11.6333 8.3961 1.5192 1.2714 10.4957 8.5436 6.3468 4.0958 3.0047 1.1781 2.0439 10.0275 10.7294 5.9698 11.1373 5.6051 1.0599 1.1022 1.0951 1.0842 1.0897 1.0952 1.1010
irintensity: 0.5861 0.6428 0.5188 1.4121 2.0954 1.0280 0.6647 3.0416 17.1939 0.8119 0.8215 1.1403 1.2981 0.6351 1.6729 7.1604 1.7751 3.9061 8.8576 6.9903 9.7106 0.0377 0.7250 3.5961 1.6774 10.4373 40.1434 30.0023 27.4615 53.3554 7.7353 52.4031 7.9572 13.9311 71.0344 172.9193 147.0561 46.0989 87.6325 199.4848 1.9543 0.5910 0.2517 44.5015 25.5173 11.6732 0.0836 4.3032 89.9812 52.5209 13.7381 72.2194 15.9141 1.2118 11.8862 5.2048 78.7020 4.7671 151.9785 62.8846 8.4656 4.4609 87.6217 5.1397 7.3857 104.4203 27.4467 18.2293 58.2837 210.8031 25.8167 1.2452 226.0225 18.2622 19.3344 2.7033 48.2527 3.0762 9.9963 53.7178 56.0232
temp: 298.150 k
press: 1.00000 atm
elementType: 9 9 9 9 9 8 8 7 6 6 6 6 6 6 6 6 6 6 6 6 6 6 1 1 1 1 1 1 1
symmnumber: 1
zpe: 467956.9 jmol-1
zpe.correction: 0.178235 hartree
zpe.thermalcorrener: 0.198025 hartree
zpe.thermalcorrenthalpy: 0.198969 hartree
zpe.thermalcorrgfe: 0.127773 hartree
zpe.sumelectzpe: -1240.516671 hartree
zpe.sumelectthermal: -1240.496882 hartree
zpe.sumelectthermalent: -1240.495937 hartree
zpe.sumelectthermalfe: -1240.567133 hartree
dipole: -3.2309 -6.5662 -0.0787
dipole: 7.3184
quadrupole: -156.8303 -175.4675 -129.7873
quadrupole: 15.9991 -3.3725 5.7224
quadrupole: -2.8019 -21.4391 24.2411 15.9991 -3.3725 5.7224
hfenergy: -1240.6949062 hartree
pointgroup: C01 [X(C14H7F5N1O2)]
dipole: -1.5606845 -2.418556 0.0717744 debye
polarizability: 216.0984189|-23.6436939|228.3730385|-10.6913527|3.4914904|134.0146632 unknown
InChI: InChI=1S/C14H7F5NO2/c15-10-8(6-7-4-2-1-3-5-7)9(14(21)22)11(16)12(17)13(10)20(18)19/h1-5H,6H2
charge -1 multiplicity 1
29 atoms
F  -0.078313 -2.143738 -1.243175
F  2.700046 2.309583 0.644283
F  3.898167 -0.160356 0.741136
F  3.80541 -2.45827 -0.969562
F  2.932302 -2.830309 1.15411
O  -0.658052 3.101894 0.648943
O  0.2299 3.408143 -1.499245
N  2.431541 -2.551803 -0.275505
C  -0.034256 0.232204 -0.809058
C  -1.45538 0.344026 -1.352559
C  0.677694 1.376954 -0.33266
C  -2.525659 -0.101015 -0.349309
C  0.60777 -1.013781 -0.75639
C  1.925521 -1.208884 -0.249326
C  1.98449 1.197245 0.172656
C  2.607149 -0.051936 0.226341
C  -2.773652 0.66113 0.824277
C  -3.284961 -1.275278 -0.580656
C  0.034327 2.774826 -0.393933
C  -3.76777 0.247486 1.739066
C  -4.280314 -1.686579 0.336103
C  -4.52612 -0.92421 1.500941
H  -1.540742 -0.270722 -2.267159
H  -1.622643 1.395656 -1.645183
H  -2.181066 1.568684 1.008601
H  -3.085937 -1.875316 -1.47731
H  -3.950049 0.844096 2.641204
H  -4.857094 -2.599689 0.143848
H  -5.296009 -1.240041 2.215822
