program: Gaussian 09
title: 000131548
version: EM64L-G09RevD.01
frameworkgroup: C1[X(C16H24NO4)]
method: RPBEPBE
basis: SDD
operation: Freq
keyword: #p
keyword: freq=noraman
keyword: PBEPBE/SDD
title: #p freq=noraman PBEPBE/SDD
converged: YES YES NO NO
title: Mulliken charges:
elementType: O O O O N C C C C C C C C C C C C C C C C H H H H H H H H H H H H H H H H H H H H H H H H
charge: -0.446993 -0.143403 -0.368382 -0.261696 -0.099964 -0.384144 -0.131192 -0.361565 -0.551891 -0.585115 -0.557194 0.225485 -0.522949 0.202212 -0.571176 0.486706 -0.411526 -0.416046 -0.227174 -0.225434 -0.236203 0.291833 0.265930 0.278922 0.285524 0.273581 0.266928 0.267877 0.261652 0.262869 0.313749 0.312306 0.259204 0.253947 0.272708 0.250335 0.391005 0.252412 0.233784 0.411284 0.236672 0.234496 0.235050 0.235392 0.240183
chargesum: 1.00000
title: Mulliken charges with hydrogens summed into heavy atoms:
elementType: O O O O N C C C C C C C C C C C C C C C C
charge: -0.055988 -0.143403 0.042902 -0.261696 -0.099964 0.173619 0.147730 -0.076041 0.256494 0.253156 0.268263 0.225485 0.000094 0.202212 -0.084980 0.486706 -0.174853 -0.181550 0.007876 0.009959 0.003980
polarizability: 2.15315996e+02 2.69318321e+01 1.84013831e+02 -8.32574780e+00 6.25341766e+00 1.64688389e+02
1716.lowfreq: -2.5305 -0.0006 -0.0005 0.0003 6.0558 8.3790 19.4885 21.8083 30.4258
frequency: 19.2816 21.7108 30.4231 40.5921 48.9375 60.9422 72.3648 82.7377 100.6740 117.5550 142.4645 173.2685 197.8515 205.1473 230.7951 234.7981 261.7010 266.6091 303.0659 314.5970 332.1794 349.9620 354.0859 355.4756 402.9898 405.9209 429.8946 457.2475 469.4074 496.8093 505.5831 529.7002 558.0879 593.3804 617.8414 653.2277 679.4213 696.2302 706.7651 731.5694 740.6238 761.4051 770.0737 822.3335 829.0782 850.8679 855.4906 872.4046 893.4798 915.2660 923.7101 944.1791 975.2011 978.8985 988.1959 990.0463 1000.9788 1008.9875 1026.8341 1047.8708 1048.9132 1051.2599 1069.0903 1081.4794 1090.9101 1112.0412 1114.8097 1147.4602 1176.0812 1188.2843 1188.6201 1194.3113 1207.0981 1216.3325 1227.4755 1253.1513 1264.9565 1282.5865 1289.7690 1305.8781 1329.0230 1340.5016 1349.2939 1365.7215 1376.2015 1382.3387 1408.4652 1412.4613 1422.8318 1429.1819 1441.8498 1443.8631 1447.8894 1458.3629 1469.8536 1476.0324 1477.5234 1481.3427 1484.9988 1493.9605 1510.6100 1593.8325 1613.1576 1613.6469 1648.2900 2957.8976 3011.8457 3015.1982 3015.9246 3021.9836 3022.6653 3026.3897 3027.2761 3057.3029 3077.5599 3096.7737 3114.2241 3116.7037 3136.5935 3138.0354 3138.8674 3142.7841 3144.8100 3149.7482 3152.5464 3162.0061 3168.3647 3327.0540 3505.6889
redmass: 4.9730 3.7916 4.1579 3.4004 4.7305 5.3227 4.1024 6.2241 3.8204 4.4246 2.7421 4.4764 5.8287 1.1387 3.5366 5.0860 3.8682 1.6951 1.8829 1.1194 2.3573 3.2867 5.1987 2.5909 2.8161 2.6699 2.1885 2.9303 3.2260 3.4947 3.0977 2.8211 4.5689 2.8513 6.3565 1.5119 1.3334 2.5093 1.8755 4.1931 3.0637 1.9765 1.8463 4.0634 3.0651 3.0315 1.2841 2.9425 3.2824 2.7434 1.5928 2.6805 2.0062 1.4199 2.8257 4.6496 1.3514 2.5690 2.2014 1.8618 1.3149 3.1641 1.8368 1.9851 1.8042 1.3838 1.3945 1.4202 1.0535 1.1202 1.2940 1.3616 1.4939 2.4394 1.8232 1.8818 1.3029 1.3860 1.4707 1.4482 1.2521 1.4879 1.2970 2.1303 1.2689 7.8120 1.1779 1.1959 1.1557 1.0860 2.1597 1.0861 1.0873 1.0874 1.0581 1.0470 1.1508 1.0628 2.1240 1.0510 1.0503 6.0347 7.3124 6.2411 9.7344 1.0607 1.0949 1.0617 1.0589 1.0318 1.0318 1.0416 1.0746 1.0864 1.1033 1.1059 1.0890 1.0881 1.1052 1.0895 1.1057 1.1053 1.1049 1.0953 1.1063 1.1053 1.1013 1.0662 1.0646
irintensity: 0.1519 0.1768 3.4298 0.4855 1.5694 1.5477 0.4654 2.4888 1.3730 1.1317 3.5494 0.0206 5.3240 0.3502 3.7955 11.7141 1.3958 1.1624 5.0024 1.8228 0.2198 4.9859 4.3804 1.6769 0.0056 0.2560 0.2596 2.4955 9.4828 14.0410 15.9227 25.5428 7.4743 80.1911 0.0842 100.4193 166.1969 31.5066 45.3738 19.2470 2.5982 47.4609 9.0676 7.7060 6.1290 14.4294 0.6321 2.6234 52.6493 24.3034 3.4955 13.1052 15.4513 1.7874 36.0541 3.0084 0.8949 41.8913 11.5200 6.7195 1.2657 78.8292 82.1969 178.3572 51.8924 3.2109 9.3217 29.6490 0.0984 1.9100 10.4777 70.1190 11.6275 0.8326 4.7000 1.4732 70.1434 31.0539 8.5819 6.3002 0.1473 19.9420 10.2128 100.5157 30.3810 0.0891 70.7198 4.8753 16.3911 20.7280 7.9029 3.1999 3.7496 13.5497 6.1129 12.4464 18.1815 48.4910 12.4355 30.2979 74.3920 2.0332 179.1531 28.9033 110.0545 20.2870 8.0106 11.3650 2.6172 1.8282 8.4709 9.6504 3.6507 14.2844 9.1221 5.3949 8.9740 12.6993 1.3357 3.3620 1.5188 4.3790 12.2541 29.6093 0.3747 5.3728 17.7656 165.1311 84.7907
temp: 298.150 k
press: 1.00000 atm
elementType: 8 8 8 8 7 6 6 6 6 6 6 6 6 6 6 6 6 6 6 6 6 1 1 1 1 1 1 1 1 1 1 1 1 1 1 1 1 1 1 1 1 1 1 1 1
symmnumber: 1
zpe: 993840.8 jmol-1
zpe.correction: 0.378534 hartree
zpe.thermalcorrener: 0.400910 hartree
zpe.thermalcorrenthalpy: 0.401854 hartree
zpe.thermalcorrgfe: 0.324296 hartree
zpe.sumelectzpe: -977.878216 hartree
zpe.sumelectthermal: -977.855841 hartree
zpe.sumelectthermalent: -977.854896 hartree
zpe.sumelectthermalfe: -977.932454 hartree
dipole: 13.6539 -7.9908 4.2212
dipole: 16.3737
quadrupole: -53.5242 -94.2433 -116.0946
quadrupole: -18.4310 6.6363 4.1631
quadrupole: 34.4298 -6.2893 -28.1405 -18.4310 6.6363 4.1631
hfenergy: -978.2567502 hartree
pointgroup: C01 [X(C16H24N1O4)]
dipole: 5.3603123 3.2607323 -1.4605107 debye
polarizability: 215.7932667|-26.4424313|182.8491281|10.1112198|5.4428712|165.3758213 unknown
InChI: InChI=1S/C16H24NO4/c1-17(2,3)11-14(19)15(16(20)21)13(18)10-9-12-7-5-4-6-8-12/h4-8,14-15,19-20H,9-11H2,1-3H3
charge 1 multiplicity 1
45 atoms
O  1.964253 0.211444 1.532522
O  -0.052439 -2.684776 0.752402
O  2.471658 -3.263221 -1.024651
O  3.21051 -2.16298 0.881848
N  3.700652 2.068757 -0.057557
C  3.137695 0.730923 -0.613235
C  1.842592 0.229419 0.077038
C  1.42716 -1.164645 -0.482363
C  4.646546 2.647927 -1.111064
C  2.585003 3.074163 0.225739
C  4.493266 1.829781 1.235006
C  0.034779 -1.606947 0.126942
C  -1.131051 -0.658527 -0.100181
C  2.463056 -2.224037 -0.132331
C  -2.521558 -1.321975 0.092997
C  -3.63539 -0.297981 -0.077078
C  -4.062885 0.491073 1.022187
C  -4.241122 -0.08713 -1.342227
C  -5.070349 1.468765 0.861425
C  -5.249728 0.889558 -1.507306
C  -5.665067 1.672819 -0.405723
H  3.955412 -0.002703 -0.511169
H  2.937286 0.901629 -1.686538
H  1.023145 0.934942 -0.138875
H  1.294035 -1.11712 -1.579916
H  5.405794 1.892723 -1.365867
H  4.069981 2.919038 -2.008724
H  5.137595 3.542506 -0.698656
H  3.046848 4.036256 0.496219
H  1.969002 3.201312 -0.677981
H  1.97742 2.704891 1.064041
H  3.809846 1.393381 1.975178
H  5.3234 1.13883 1.021324
H  4.888693 2.79687 1.582945
H  -1.031451 0.172943 0.630746
H  -1.058137 -0.196012 -1.105245
H  2.43524 -0.640478 1.782234
H  -2.553967 -1.781258 1.096633
H  -2.630597 -2.144618 -0.636974
H  3.057426 -4.009416 -0.718072
H  -3.622721 0.323121 2.013746
H  -3.938729 -0.704681 -2.197828
H  -5.401135 2.059601 1.722712
H  -5.718701 1.030804 -2.4873
H  -6.45307 2.423429 -0.529724
